OpenZWave Compile Test on Mac (Not Always Online) - Devel

Build: #771 failed Child of OZW-OZWLNX-1387

Build result summary

Details

Completed
Duration
2 minutes
Labels
None
Agent
osx-buildhost.dmz.dynam.ac
Revision
e3bae88f29139032c736144b67e7c67d3a764b2b e3bae88f29139032c736144b67e7c67d3a764b2b
No failed test found. A possible compilation error occurred.

Responsible

No one has taken responsibility for this failure

Code commits

Author Commit Message Commit date
Michael Bisbjerg <michael@mbwarez.dk> Michael Bisbjerg <michael@mbwarez.dk> e3bae88f29139032c736144b67e7c67d3a764b2b e3bae88f29139032c736144b67e7c67d3a764b2b Add missing option for ZW162 (Aeotec Doorbell 6) (#2176)

Add the parameter 0x60 (90), a boolean to specify if the action button stops the currently playing chime.

Also update the link to the Doorbell 6 technical docs.
Sjoerd Mulder <sjoerdmulder@gmail.com> Sjoerd Mulder <sjoerdmulder@gmail.com> 85171d4f10c569b6369fd8734ced1e0e6a8b3c74 85171d4f10c569b6369fd8734ced1e0e6a8b3c74 Fix for Compile Warning in Color CommandClass #1588
Travis Haagen <travis.haagen@gmail.com> Travis Haagen <travis.haagen@gmail.com> f7182b1feec312a093609fee3cd436d6122e6838 f7182b1feec312a093609fee3cd436d6122e6838 Fix snprintf truncated value (#2170)

Error summary for Default Job

The job generated some errors, drill down into the full build log for more details.

/Users/fish/bamboo-agent-home/xml-data/build-dir/OZW-OZWMAC-JOB1/cpp/src/command_classes/Configuration.cpp:126:45: error: format specifies type 'unsigned short' but the argument has type 'uint8' (aka 'unsigned char') [-Werror,-Wformat]
                                                snprintf(label, 16, "Parameter #%hu", parameter);
                                                                                ~~~   ^~~~~~~~~
                                                                                %hhu
1 error generated.
make[1]: *** [/Users/fish/bamboo-agent-home/xml-data/build-dir/OZW-OZWMAC-JOB1/.lib/Configuration.o] Error 1
make: *** [all] Error 2