OpenZWave Compile Test - Devel (Linux/Windows)

Build: #1542 did not complete

Job: VS2017 Build failed

Stages & jobs

  1. Linux Builds

  2. Windows Build

  3. Doc

Job result summary

Completed
Duration
4 minutes
Agent
Win2016-buildhost-2.dmz.dynam.ac
Revision
f150a985de47ddcaca5fdba97bda71688c4a4069 f150a985de47ddcaca5fdba97bda71688c4a4069
No failed test found. A possible compilation error occurred.

Error summary

The build generated some errors. See the full build log for more details.

     Creating library C:\Users\bamboo\bamboo-agent-home\xml-data\build-dir\OZW-OZWLNX-VS2017\cpp\examples\windows\MinOZW\vs2010\Debug\MinOZW.lib and object C:\Users\bamboo\bamboo-agent-home\xml-data\build-dir\OZW-OZWLNX-VS2017\cpp\examples\windows\MinOZW\vs2010\Debug\MinOZW.exp
OpenZWave.lib(CommandClasses.obj) : error LNK2001: unresolved external symbol "public: virtual unsigned char __thiscall OpenZWave::Internal::CC::Supervision::CreateSupervisionSession(unsigned char,unsigned char)" (?CreateSupervisionSession@Supervision@CC@Internal@OpenZWave@@UAEEEE@Z) [C:\Users\bamboo\bamboo-agent-home\xml-data\build-dir\OZW-OZWLNX-VS2017\cpp\examples\windows\MinOZW\vs2010\MinOZW.vcxproj]
OpenZWave.lib(CommandClasses.obj) : error LNK2001: unresolved external symbol "public: virtual unsigned int __thiscall OpenZWave::Internal::CC::Supervision::GetSupervisionIndex(unsigned char)" (?GetSupervisionIndex@Supervision@CC@Internal@OpenZWave@@UAEIE@Z) [C:\Users\bamboo\bamboo-agent-home\xml-data\build-dir\OZW-OZWLNX-VS2017\cpp\examples\windows\MinOZW\vs2010\MinOZW.vcxproj]
OpenZWave.lib(CommandClasses.obj) : error LNK2001: unresolved external symbol "public: virtual bool __thiscall OpenZWave::Internal::CC::Supervision::HandleIncomingMsg(unsigned char const *,unsigned int,unsigned int)" (?HandleIncomingMsg@Supervision@CC@Internal@OpenZWave@@UAE_NPBEII@Z) [C:\Users\bamboo\bamboo-agent-home\xml-data\build-dir\OZW-OZWLNX-VS2017\cpp\examples\windows\MinOZW\vs2010\MinOZW.vcxproj]
OpenZWave.lib(CommandClasses.obj) : error LNK2001: unresolved external symbol "public: virtual bool __thiscall OpenZWave::Internal::CC::Supervision::HandleMsg(unsigned char const *,unsigned int,unsigned int)" (?HandleMsg@Supervision@CC@Internal@OpenZWave@@UAE_NPBEII@Z) [C:\Users\bamboo\bamboo-agent-home\xml-data\build-dir\OZW-OZWLNX-VS2017\cpp\examples\windows\MinOZW\vs2010\MinOZW.vcxproj]
(Link target) ->
  OpenZWave.lib(CommandClasses.obj) : error LNK2001: unresolved external symbol "public: virtual unsigned char __thiscall OpenZWave::Internal::CC::Supervision::CreateSupervisionSession(unsigned char,unsigned char)" (?CreateSupervisionSession@Supervision@CC@Internal@OpenZWave@@UAEEEE@Z) [C:\Users\bamboo\bamboo-agent-home\xml-data\build-dir\OZW-OZWLNX-VS2017\cpp\examples\windows\MinOZW\vs2010\MinOZW.vcxproj]
  OpenZWave.lib(CommandClasses.obj) : error LNK2001: unresolved external symbol "public: virtual unsigned int __thiscall OpenZWave::Internal::CC::Supervision::GetSupervisionIndex(unsigned char)" (?GetSupervisionIndex@Supervision@CC@Internal@OpenZWave@@UAEIE@Z) [C:\Users\bamboo\bamboo-agent-home\xml-data\build-dir\OZW-OZWLNX-VS2017\cpp\examples\windows\MinOZW\vs2010\MinOZW.vcxproj]
  OpenZWave.lib(CommandClasses.obj) : error LNK2001: unresolved external symbol "public: virtual bool __thiscall OpenZWave::Internal::CC::Supervision::HandleIncomingMsg(unsigned char const *,unsigned int,unsigned int)" (?HandleIncomingMsg@Supervision@CC@Internal@OpenZWave@@UAE_NPBEII@Z) [C:\Users\bamboo\bamboo-agent-home\xml-data\build-dir\OZW-OZWLNX-VS2017\cpp\examples\windows\MinOZW\vs2010\MinOZW.vcxproj]
  OpenZWave.lib(CommandClasses.obj) : error LNK2001: unresolved external symbol "public: virtual bool __thiscall OpenZWave::Internal::CC::Supervision::HandleMsg(unsigned char const *,unsigned int,unsigned int)" (?HandleMsg@Supervision@CC@Internal@OpenZWave@@UAE_NPBEII@Z) [C:\Users\bamboo\bamboo-agent-home\xml-data\build-dir\OZW-OZWLNX-VS2017\cpp\examples\windows\MinOZW\vs2010\MinOZW.vcxproj]