OpenZWave Compile Test - Devel (Linux/Windows)

Build: #1207 failed Changes by Justin Hammond

Build result summary

Details

Completed
Duration
1 minute
Labels
None
Revision
cbefe84f4668300c32b0b36c7cf21682a261ddae cbefe84f4668300c32b0b36c7cf21682a261ddae
Fixed in
#1210 (Changes by Justin Hammond)

No failed tests found, a possible compilation error occurred.

Responsible

Code commits

Author Commit Message Commit date
Justin Hammond Justin Hammond cbefe84f4668300c32b0b36c7cf21682a261ddae cbefe84f4668300c32b0b36c7cf21682a261ddae Cleanup some very minor Memory Leaks. Nothing Major here
Justin Hammond Justin Hammond 53b041f92bdd635f596e42ec0050302663cae8cc 53b041f92bdd635f596e42ec0050302663cae8cc Add Leak Suppressions File
Justin Hammond Justin Hammond eab8d30471d0310812a798f37cb62aff9c418bb2 eab8d30471d0310812a798f37cb62aff9c418bb2 Technically - These are not leaks as the Classes are static and intended to live for the lifetime of the application. But Lets cleanup so leak report is clean

Error summary for Linux Build

The job generated some errors, drill down into the full build log for more details.

In file included from /home/fish/bamboo-agent-home/xml-data/build-dir/OZW-OZWLNX-JOB1/cpp/src/Driver.h:38,
                 from /home/fish/bamboo-agent-home/xml-data/build-dir/OZW-OZWLNX-JOB1/cpp/src/command_classes/CommandClass.h:36,
                 from /home/fish/bamboo-agent-home/xml-data/build-dir/OZW-OZWLNX-JOB1/cpp/src/command_classes/Proprietary.h:31,
                 from /home/fish/bamboo-agent-home/xml-data/build-dir/OZW-OZWLNX-JOB1/cpp/src/command_classes/Proprietary.cpp:29:
/home/fish/bamboo-agent-home/xml-data/build-dir/OZW-OZWLNX-JOB1/cpp/src/Node.h:566:32: error: 'std::shared_ptr' has not been declared
    void SetProductDetails(std::shared_ptr<Internal::ProductDescriptor> product);
                                ^~~~~~~~~~
/home/fish/bamboo-agent-home/xml-data/build-dir/OZW-OZWLNX-JOB1/cpp/src/Node.h:566:42: error: expected ',' or '...' before '<' token
    void SetProductDetails(std::shared_ptr<Internal::ProductDescriptor> product);
                                          ^
/home/fish/bamboo-agent-home/xml-data/build-dir/OZW-OZWLNX-JOB1/cpp/src/Node.h:621:9: error: 'shared_ptr' in namespace 'std' does not name a template type
    std::shared_ptr<Internal::ProductDescriptor> m_Product;
         ^~~~~~~~~~
/home/fish/bamboo-agent-home/xml-data/build-dir/OZW-OZWLNX-JOB1/cpp/src/Node.h:621:4: note: 'std::shared_ptr' is defined in header '<memory>'; did you forget to '#include <memory>'?
/home/fish/bamboo-agent-home/xml-data/build-dir/OZW-OZWLNX-JOB1/cpp/src/Node.h:40:1:
+#include <memory>
#include "Group.h"
/home/fish/bamboo-agent-home/xml-data/build-dir/OZW-OZWLNX-JOB1/cpp/src/Node.h:621:4:
    std::shared_ptr<Internal::ProductDescriptor> m_Product;
    ^~~
make[1]: *** [/home/fish/bamboo-agent-home/xml-data/build-dir/OZW-OZWLNX-JOB1/cpp/build/support.mk:159: /home/fish/bamboo-agent-home/xml-data/build-dir/OZW-OZWLNX-JOB1/.lib/Proprietary.o] Error 1
make: *** [Makefile:23: all] Error 2
gzip: warning: GZIP environment variable is deprecated; use an alias or script