OpenZWave Compile Test - Devel (Linux/Windows)

Build: #1194 failed Changes by Justin Hammond

Build result summary

Details

Completed
Duration
1 minute
Labels
None
Revision
3d1a95361ef78ec7cb2e45a5db67ee70409c8fd3 3d1a95361ef78ec7cb2e45a5db67ee70409c8fd3
Failing since
#1189 (Changes by Justin Hammond)
Fixed in
#1197 (Changes by Justin Hammond)

No failed tests found, a possible compilation error occurred.

Responsible

Code commits

Author Commit Message Commit date
Justin Hammond Justin Hammond 3d1a95361ef78ec7cb2e45a5db67ee70409c8fd3 3d1a95361ef78ec7cb2e45a5db67ee70409c8fd3 Update Meter Class to Version 5 - Issue #1836

Error summary for Linux Build

The job generated some errors, drill down into the full build log for more details.

/home/fish/bamboo-agent-home/xml-data/build-dir/OZW-OZWLNX-JOB1/cpp/src/command_classes/Meter.cpp: In member function 'virtual void OpenZWave::Internal::CC::Meter::CreateVars(uint8)':
/home/fish/bamboo-agent-home/xml-data/build-dir/OZW-OZWLNX-JOB1/cpp/src/command_classes/Meter.cpp:485:15: error: unused variable 'node' [-Werror=unused-variable]
     if (Node* node = GetNodeUnsafe())
               ^~~~
cc1plus: all warnings being treated as errors
make[1]: *** [/home/fish/bamboo-agent-home/xml-data/build-dir/OZW-OZWLNX-JOB1/cpp/build/support.mk:156: /home/fish/bamboo-agent-home/xml-data/build-dir/OZW-OZWLNX-JOB1/.lib/Meter.o] Error 1
make: *** [Makefile:23: all] Error 2
gzip: warning: GZIP environment variable is deprecated; use an alias or script