OpenZWave Compile Test - Devel (Linux/Windows)

Build: #1191 failed Changes by Justin Hammond and Peter Gebruers

Build result summary

Details

Completed
Duration
2 minutes
Labels
None
Revision
74c719c75d9165efe4a956eeffb2cba1731c7670 74c719c75d9165efe4a956eeffb2cba1731c7670
Failing since
#1189 (Changes by Justin Hammond)
Fixed in
#1197 (Changes by Justin Hammond)

No failed tests found, a possible compilation error occurred.

Responsible

Code commits

Author Commit Message Commit date
Peter Gebruers Peter Gebruers 74c719c75d9165efe4a956eeffb2cba1731c7670 74c719c75d9165efe4a956eeffb2cba1731c7670 Update device config PA-100 + add to database (#1833)
Justin Hammond Justin Hammond ce043aa52fbdeda7c411b320ad8363e0ee2180de ce043aa52fbdeda7c411b320ad8363e0ee2180de Update Revision
Peter Gebruers Peter Gebruers baeeb8dd2b2cdc13a1301da83bea1bd16c6aa302 baeeb8dd2b2cdc13a1301da83bea1bd16c6aa302 Update Qubino ZMNHADx (#1832)

Fixes #1820

Jira issues

IssueDescriptionStatus
Unknown Issue TypePA-100Could not obtain issue details from Jira

Error summary for Linux Build

The job generated some errors, drill down into the full build log for more details.

/bin/ld: /home/fish/bamboo-agent-home/xml-data/build-dir/OZW-OZWLNX-JOB1/.lib/Main.o: in function `main':
/home/fish/bamboo-agent-home/xml-data/build-dir/OZW-OZWLNX-JOB1/cpp/examples/MinOZW/Main.cpp:369: undefined reference to `OpenZWave::ValueID::GetTypeAsString[abi:cxx11]() const'
/bin/ld: /home/fish/bamboo-agent-home/xml-data/build-dir/OZW-OZWLNX-JOB1/cpp/examples/MinOZW/Main.cpp:374: undefined reference to `OpenZWave::ValueID::GetGenreAsString[abi:cxx11]() const'
collect2: error: ld returned 1 exit status
make[1]: *** [Makefile:70: /home/fish/bamboo-agent-home/xml-data/build-dir/OZW-OZWLNX-JOB1/.lib/MinOZW] Error 1
make: *** [Makefile:24: all] Error 2
gzip: warning: GZIP environment variable is deprecated; use an alias or script