OpenZWave Compile Test - Devel (Linux/Windows)

Build result summary

Details

Completed
Duration
3 minutes
Labels
None
Revision
d2a5f36970e658ca367d48f00e32af7ba76e1bfc d2a5f36970e658ca367d48f00e32af7ba76e1bfc
Failing since
#1189 (Changes by Justin Hammond)
Fixed in
#1197 (Changes by Justin Hammond)

No failed tests found, a possible compilation error occurred.

Responsible

Code commits

Author Commit Message Commit date
Narek911 <31692249+Narek911@users.noreply.github.com> Narek911 <31692249+Narek911@users.noreply.github.com> d2a5f36970e658ca367d48f00e32af7ba76e1bfc d2a5f36970e658ca367d48f00e32af7ba76e1bfc XML config files for Heltun Switcher and FanCoil Termostat (#1825)

* Heltun Switcher and FanCoil Termostat

Error summary for Linux Build

The job generated some errors, drill down into the full build log for more details.

/bin/ld: /home/fish/bamboo-agent-home/xml-data/build-dir/OZW-OZWLNX-JOB1/.lib/Main.o: in function `main':
/home/fish/bamboo-agent-home/xml-data/build-dir/OZW-OZWLNX-JOB1/cpp/examples/MinOZW/Main.cpp:369: undefined reference to `OpenZWave::ValueID::GetTypeAsString[abi:cxx11]() const'
/bin/ld: /home/fish/bamboo-agent-home/xml-data/build-dir/OZW-OZWLNX-JOB1/cpp/examples/MinOZW/Main.cpp:374: undefined reference to `OpenZWave::ValueID::GetGenreAsString[abi:cxx11]() const'
collect2: error: ld returned 1 exit status
make[1]: *** [Makefile:70: /home/fish/bamboo-agent-home/xml-data/build-dir/OZW-OZWLNX-JOB1/.lib/MinOZW] Error 1
make: *** [Makefile:24: all] Error 2
gzip: warning: GZIP environment variable is deprecated; use an alias or script