Coverity Check for OZW

Build result summary


15 seconds
6e03f5fda0726cc449a902320dedf5838ea557d2 6e03f5fda0726cc449a902320dedf5838ea557d2
Failing since
#135 (Scheduled with changes by Justin Hammond)

No failed tests found, a possible compilation error occurred.


Code commits

Author Commit Message Commit date
Justin Hammond Justin Hammond 6e03f5fda0726cc449a902320dedf5838ea557d2 6e03f5fda0726cc449a902320dedf5838ea557d2 Create LICENSE
Peter Gebruers <> Peter Gebruers <> acd9f31b9a372a7698e72a0cd1443ac569045dcf acd9f31b9a372a7698e72a0cd1443ac569045dcf Update device_classes.xml and fix logging bugs (#1815)

* xmllint device_classes.xml for easier diffing

* Add newer device types to device_classes.xml

* Fix incorrect logging of Device Type
When _deviceType was not found in config/device_classes.xml, the message printed another variable.
Minor adjustments to format strings.

* Add device types based on public spec release 2019B

* Fix logging of ZWave+ Role Type
Justin Hammond Justin Hammond 7c64cd724d45ad9002ac1eeabd15c14c13fafb52 7c64cd724d45ad9002ac1eeabd15c14c13fafb52 Create FUNDING.yml
Justin Hammond Justin Hammond 5a27194ef60c46eda621bb34a186b1a72849ac5d 5a27194ef60c46eda621bb34a186b1a72849ac5d another 136 updates
Justin Hammond Justin Hammond 04e86830f397ee90f3af326040690d1d0c25d5b8 04e86830f397ee90f3af326040690d1d0c25d5b8 Update config for ZW121 LED Strip

Jira issues

Unknown Issue TypeCRC-3Could not obtain issue details from Jira
Unknown Issue TypeWD500Z5-1Could not obtain issue details from Jira

Error summary for Linux Build

The job generated some errors, drill down into the full build log for more details.

cc1plus: error: unrecognized command line option "-std=c++11"
make[1]: *** [/usr/local/bamboo-data/xml-data/build-dir/131073/OZW-OZC-JOB1/.lib/tinystr.o] Error 1
make: *** [all] Error 2
[WARNING] Build command make exited with code 2. Please verify that the build completed successfully.
[WARNING] No files were emitted. This may be due to a problem with your configuration
or because no files were actually compiled by your build command.
Please make sure you have configured the compilers actually used in the compilation.
For more details, please look at:
Command failed.