ozwdaemon Docker Image Builds

Build: #183 failed

Job: Armhf Build failed

Build log

The build generated 3,039 lines of output.The output is too long and has been truncated to the last 1,000 lines. Download or view full build log

03-Jan-2021 00:07:19 #24 4.945 Project MESSAGE: OpenZWave Summary:
03-Jan-2021 00:07:19 #24 4.945 Project MESSAGE:     OpenZWave Library Path: /opt/open-zwave
03-Jan-2021 00:07:19 #24 4.945 Project MESSAGE:     OpenZWave Include Path: /opt/open-zwave/cpp/src
03-Jan-2021 00:07:19 #24 4.945 Project MESSAGE:     OpenZWave Libs Command: -L/opt/open-zwave -lopenzwave
03-Jan-2021 00:07:19 #24 4.946 Project MESSAGE:     OpenZWave Database Path: /opt/open-zwave/config
03-Jan-2021 00:07:19 #24 4.946 Project MESSAGE: 
03-Jan-2021 00:07:19 #24 4.946 Project MESSAGE: Found QTOZW in /opt/qt-openzwave
03-Jan-2021 00:07:19 #24 4.946 Project MESSAGE: 
03-Jan-2021 00:07:19 #24 4.946 Project MESSAGE: QT-OpenZWave Summary:
03-Jan-2021 00:07:19 #24 4.947 Project MESSAGE:     QT-OpenZWave Library Path: /opt/qt-openzwave/qt-openzwave
03-Jan-2021 00:07:19 #24 4.947 Project MESSAGE:     QT-OpenZWave Include Path: /opt/qt-openzwave/qt-openzwave/include /opt/qt-openzwave/qt-openzwavedatabase/include
03-Jan-2021 00:07:19 #24 4.947 Project MESSAGE:     QT-OpenZWave Libs Command: -L/opt/qt-openzwave/qt-openzwave -lqt-openzwave -L/opt/qt-openzwave/qt-openzwavedatabase -lqt-openzwavedatabase
03-Jan-2021 00:07:19 #24 4.947 Project MESSAGE: 
03-Jan-2021 00:07:20 #24 6.540 Reading /opt/ozw-admin/devicedb-lib/devicedb-lib.pro
03-Jan-2021 00:07:21 #24 7.071 Reading /opt/ozw-admin/ozwadmin-main/ozwadmin-main.pro
03-Jan-2021 00:07:21 #24 7.085 Project MESSAGE: V0.1.0-75-gf68b43e
03-Jan-2021 00:07:21 #24 7.085 Project MESSAGE: V0.1.0 75 gf68b43e
03-Jan-2021 00:07:21 #24 7.085 Project MESSAGE: Building Version 0.1.75
03-Jan-2021 00:07:21 #24 7.086 Project MESSAGE: Found OZW in /opt/open-zwave
03-Jan-2021 00:07:21 #24 7.086 Project MESSAGE: 
03-Jan-2021 00:07:21 #24 7.086 Project MESSAGE: OpenZWave Summary:
03-Jan-2021 00:07:21 #24 7.086 Project MESSAGE:     OpenZWave Library Path: /opt/open-zwave
03-Jan-2021 00:07:21 #24 7.086 Project MESSAGE:     OpenZWave Include Path: /opt/open-zwave/cpp/src
03-Jan-2021 00:07:21 #24 7.086 Project MESSAGE:     OpenZWave Libs Command: -L/opt/open-zwave -lopenzwave
03-Jan-2021 00:07:21 #24 7.086 Project MESSAGE:     OpenZWave Database Path: /opt/open-zwave/config
03-Jan-2021 00:07:21 #24 7.086 Project MESSAGE: 
03-Jan-2021 00:07:21 #24 7.086 Project MESSAGE: Found QTOZW in /opt/qt-openzwave
03-Jan-2021 00:07:21 #24 7.086 Project MESSAGE: 
03-Jan-2021 00:07:21 #24 7.086 Project MESSAGE: QT-OpenZWave Summary:
03-Jan-2021 00:07:21 #24 7.086 Project MESSAGE:     QT-OpenZWave Library Path: /opt/qt-openzwave/qt-openzwave
03-Jan-2021 00:07:21 #24 7.086 Project MESSAGE:     QT-OpenZWave Include Path: /opt/qt-openzwave/qt-openzwave/include /opt/qt-openzwave/qt-openzwavedatabase/include
03-Jan-2021 00:07:21 #24 7.086 Project MESSAGE:     QT-OpenZWave Libs Command: -L/opt/qt-openzwave/qt-openzwave -lqt-openzwave -L/opt/qt-openzwave/qt-openzwavedatabase -lqt-openzwavedatabase
03-Jan-2021 00:07:21 #24 7.086 Project MESSAGE: 
03-Jan-2021 00:07:22 #24 8.230 cd ozwadmin-widgets/ && ( test -e Makefile || /opt/qt/5.12.9/bin/qmake -o Makefile /opt/ozw-admin/ozwadmin-widgets/ozwadmin-widgets.pro CONFIG+=release ) && make -f Makefile
03-Jan-2021 00:07:22 #24 8.436 make[1]: Entering directory '/opt/ozw-admin/ozwadmin-widgets'
03-Jan-2021 00:07:22 #24 8.437 uic HelpEditorDlg.ui
03-Jan-2021 00:07:22 #24 8.452 uic ListDialog.ui
03-Jan-2021 00:07:22 #24 8.453 uic bitsetwidget.ui
03-Jan-2021 00:07:22 #24 8.463 uic nodeflagswidget.ui
03-Jan-2021 00:07:22 #24 8.524 compiling node_delegate.cpp
03-Jan-2021 00:07:22 #24 8.528 compiling nodeflagswidget.cpp
03-Jan-2021 00:07:22 #24 8.535 generating ./moc_predefs.h
03-Jan-2021 00:07:22 #24 8.556 compiling propertybrowser/qtpropertybrowserutils.cpp
03-Jan-2021 00:07:22 #24 8.567 compiling value_delegate.cpp
03-Jan-2021 00:07:22 #24 8.575 compiling qt-ads/ads_globals.cpp
03-Jan-2021 00:07:22 #24 8.589 compiling qt-ads/DockAreaWidget.cpp
03-Jan-2021 00:07:22 #24 8.594 compiling qt-ads/DockAreaTabBar.cpp
03-Jan-2021 00:07:22 #24 8.624 compiling qt-ads/DockContainerWidget.cpp
03-Jan-2021 00:07:22 #24 8.651 compiling qt-ads/DockManager.cpp
03-Jan-2021 00:07:22 #24 8.691 compiling qt-ads/DockWidget.cpp
03-Jan-2021 00:07:22 #24 8.704 compiling qt-ads/DockingStateReader.cpp
03-Jan-2021 00:07:22 #24 8.741 compiling qt-ads/DockWidgetTab.cpp
03-Jan-2021 00:07:26 #24 12.44 compiling qt-ads/FloatingDockContainer.cpp
03-Jan-2021 00:07:26 #24 12.64 compiling qt-ads/FloatingDragPreview.cpp
03-Jan-2021 00:07:27 #24 13.49 compiling qt-ads/DockOverlay.cpp
03-Jan-2021 00:07:27 #24 13.68 compiling qt-ads/DockSplitter.cpp
03-Jan-2021 00:07:28 #24 14.65 moc qt-ads/DockAreaTitleBar.cpp
03-Jan-2021 00:07:28 #24 14.70 compiling qt-ads/ElidingLabel.cpp
03-Jan-2021 00:07:28 #24 14.94 compiling qt-ads/IconProvider.cpp
03-Jan-2021 00:07:29 #24 15.58 compiling qt-ads/DockComponentsFactory.cpp
03-Jan-2021 00:07:30 #24 16.35 compiling qt-ads/linux/FloatingWidgetTitleBar.cpp
03-Jan-2021 00:07:30 #24 16.36 rcc propertybrowser/qtpropertybrowser.qrc
03-Jan-2021 00:07:30 #24 16.40 rcc qt-ads/ads.qrc
03-Jan-2021 00:07:30 #24 16.41 moc widgets.h
03-Jan-2021 00:07:30 #24 16.65 moc bitsetwidget.h
03-Jan-2021 00:07:30 #24 16.65 moc node_delegate.h
03-Jan-2021 00:07:30 #24 16.80 moc nodeflagswidget.h
03-Jan-2021 00:07:31 #24 17.00 moc propertybrowser/qtpropertybrowserutils_p.h
03-Jan-2021 00:07:31 #24 17.43 moc value_delegate.h
03-Jan-2021 00:07:31 #24 17.95 moc qt-ads/DockAreaWidget.h
03-Jan-2021 00:07:32 #24 18.20 moc qt-ads/DockAreaTabBar.h
03-Jan-2021 00:07:32 #24 18.45 moc qt-ads/DockContainerWidget.h
03-Jan-2021 00:07:32 #24 18.64 moc qt-ads/DockManager.h
03-Jan-2021 00:07:32 #24 18.72 moc qt-ads/DockWidget.h
03-Jan-2021 00:07:32 #24 18.91 value_delegate.cpp: In member function 'virtual void Value_Delegate::paint(QPainter*, const QStyleOptionViewItem&, const QModelIndex&) const':
03-Jan-2021 00:07:32 #24 18.91 value_delegate.cpp:63:31: warning: this statement may fall through [-Wimplicit-fallthrough=]
03-Jan-2021 00:07:32 #24 18.91 value_delegate.cpp:95:5: note: here
03-Jan-2021 00:07:32 #24 18.91 At global scope:
03-Jan-2021 00:07:32 #24 18.91 cc1plus: warning: unrecognized command line option '-Wno-deprecated-copy'
03-Jan-2021 00:07:32 #24 18.94 moc qt-ads/DockWidgetTab.h
03-Jan-2021 00:07:32 #24 18.95 moc qt-ads/FloatingDockContainer.h
03-Jan-2021 00:07:33 #24 19.28 moc qt-ads/FloatingDragPreview.h
03-Jan-2021 00:07:33 #24 19.40 moc qt-ads/DockOverlay.h
03-Jan-2021 00:07:33 #24 19.81 moc qt-ads/DockSplitter.h
03-Jan-2021 00:07:33 #24 19.85 moc qt-ads/DockAreaTitleBar.h
03-Jan-2021 00:07:34 #24 20.24 moc qt-ads/ElidingLabel.h
03-Jan-2021 00:07:34 #24 20.62 moc qt-ads/linux/FloatingWidgetTitleBar.h
03-Jan-2021 00:07:35 #24 21.02 compiling widgets.cpp
03-Jan-2021 00:07:35 #24 21.10 compiling bitsetwidget.cpp
03-Jan-2021 00:07:35 #24 21.20 moc propertybrowser/qtbuttonpropertybrowser.h
03-Jan-2021 00:07:35 #24 21.58 moc propertybrowser/qteditorfactory.h
03-Jan-2021 00:07:35 #24 21.73 moc propertybrowser/qtgroupboxpropertybrowser.h
03-Jan-2021 00:07:35 #24 21.79 moc propertybrowser/qtpropertybrowser.h
03-Jan-2021 00:07:36 #24 22.05 moc propertybrowser/qtpropertymanager.h
03-Jan-2021 00:07:36 #24 22.06 moc propertybrowser/qttreepropertybrowser.h
03-Jan-2021 00:07:36 #24 22.08 moc propertybrowser/qtvariantproperty.h
03-Jan-2021 00:07:36 #24 22.33 compiling qt-ads/DockAreaTitleBar.cpp
03-Jan-2021 00:07:36 #24 22.34 compiling qrc_qtpropertybrowser.cpp
03-Jan-2021 00:07:36 #24 22.62 compiling qrc_ads.cpp
03-Jan-2021 00:07:36 #24 22.63 compiling moc_widgets.cpp
03-Jan-2021 00:07:36 #24 22.91 compiling moc_bitsetwidget.cpp
03-Jan-2021 00:07:37 #24 23.22 compiling moc_node_delegate.cpp
03-Jan-2021 00:07:37 #24 23.56 compiling moc_nodeflagswidget.cpp
03-Jan-2021 00:07:37 #24 23.58 compiling moc_qtpropertybrowserutils_p.cpp
03-Jan-2021 00:07:37 #24 23.65 compiling moc_value_delegate.cpp
03-Jan-2021 00:07:37 #24 23.74 compiling moc_DockAreaWidget.cpp
03-Jan-2021 00:07:37 #24 23.91 compiling moc_DockAreaTabBar.cpp
03-Jan-2021 00:07:38 #24 24.15 compiling moc_DockContainerWidget.cpp
03-Jan-2021 00:07:41 #24 27.01 compiling moc_DockManager.cpp
03-Jan-2021 00:07:41 #24 27.46 compiling moc_DockWidget.cpp
03-Jan-2021 00:07:41 #24 27.81 compiling moc_DockWidgetTab.cpp
03-Jan-2021 00:07:42 #24 27.99 compiling moc_FloatingDockContainer.cpp
03-Jan-2021 00:07:42 #24 28.20 compiling moc_FloatingDragPreview.cpp
03-Jan-2021 00:07:42 #24 28.41 compiling moc_DockOverlay.cpp
03-Jan-2021 00:07:42 #24 28.58 compiling moc_DockSplitter.cpp
03-Jan-2021 00:07:44 #24 30.32 compiling moc_DockAreaTitleBar.cpp
03-Jan-2021 00:07:44 #24 30.72 compiling moc_ElidingLabel.cpp
03-Jan-2021 00:07:44 #24 30.80 compiling moc_FloatingWidgetTitleBar.cpp
03-Jan-2021 00:07:44 #24 30.89 compiling propertybrowser/qtbuttonpropertybrowser.cpp
03-Jan-2021 00:07:45 #24 31.23 moc propertybrowser/qteditorfactory.cpp
03-Jan-2021 00:07:45 #24 31.53 compiling propertybrowser/qtgroupboxpropertybrowser.cpp
03-Jan-2021 00:07:45 #24 31.64 compiling propertybrowser/qtpropertybrowser.cpp
03-Jan-2021 00:07:46 #24 32.00 moc propertybrowser/qtpropertymanager.cpp
03-Jan-2021 00:07:46 #24 32.06 moc propertybrowser/qttreepropertybrowser.cpp
03-Jan-2021 00:07:46 #24 32.24 compiling propertybrowser/qtvariantproperty.cpp
03-Jan-2021 00:07:46 #24 32.40 compiling propertybrowser/qteditorfactory.cpp
03-Jan-2021 00:07:47 #24 33.54 compiling propertybrowser/qttreepropertybrowser.cpp
03-Jan-2021 00:07:47 #24 33.66 compiling propertybrowser/qtpropertymanager.cpp
03-Jan-2021 00:08:06 #24 52.01 propertybrowser/qtpropertymanager.cpp: In member function 'virtual void QtEnumPropertyManager::initializeProperty(QtProperty*)':
03-Jan-2021 00:08:06 #24 52.01 propertybrowser/qtpropertymanager.cpp:4820:12: warning: '<anonymous>.QtEnumPropertyManagerPrivate::Data::readOnly' may be used uninitialized in this function [-Wmaybe-uninitialized]
03-Jan-2021 00:08:06 #24 52.01 At global scope:
03-Jan-2021 00:08:06 #24 52.01 cc1plus: warning: unrecognized command line option '-Wno-deprecated-copy'
03-Jan-2021 00:08:07 #24 53.17 rm -f libozwadmin-widgets.a
03-Jan-2021 00:08:07 #24 53.17 ar cqs libozwadmin-widgets.a widgets.o bitsetwidget.o node_delegate.o nodeflagswidget.o qtbuttonpropertybrowser.o qteditorfactory.o qtgroupboxpropertybrowser.o qtpropertybrowser.o qtpropertybrowserutils.o qtpropertymanager.o qttreepropertybrowser.o qtvariantproperty.o value_delegate.o ads_globals.o DockAreaWidget.o DockAreaTabBar.o DockContainerWidget.o DockManager.o DockWidget.o DockingStateReader.o DockWidgetTab.o FloatingDockContainer.o FloatingDragPreview.o DockOverlay.o DockSplitter.o DockAreaTitleBar.o ElidingLabel.o IconProvider.o DockComponentsFactory.o FloatingWidgetTitleBar.o qrc_qtpropertybrowser.o qrc_ads.o moc_widgets.o moc_bitsetwidget.o moc_node_delegate.o moc_nodeflagswidget.o moc_qtpropertybrowserutils_p.o moc_value_delegate.o moc_DockAreaWidget.o moc_DockAreaTabBar.o moc_DockContainerWidget.o moc_DockManager.o moc_DockWidget.o moc_DockWidgetTab.o moc_FloatingDockContainer.o moc_FloatingDragPreview.o moc_DockOverlay.o moc_DockSplitter.o moc_DockAreaTitleBar.o moc_ElidingLabel.o moc_FloatingWidgetTitleBar.o
03-Jan-2021 00:08:07 #24 53.29 make[1]: Leaving directory '/opt/ozw-admin/ozwadmin-widgets'
03-Jan-2021 00:08:07 #24 53.29 cd devicedb-lib/ && ( test -e Makefile || /opt/qt/5.12.9/bin/qmake -o Makefile /opt/ozw-admin/devicedb-lib/devicedb-lib.pro CONFIG+=release ) && make -f Makefile
03-Jan-2021 00:08:07 #24 53.48 make[1]: Entering directory '/opt/ozw-admin/devicedb-lib'
03-Jan-2021 00:08:07 #24 53.48 uic devicedb.ui
03-Jan-2021 00:08:07 #24 53.54 compiling deviceconfigxmlreader.cpp
03-Jan-2021 00:08:07 #24 53.55 compiling devicedb.cpp
03-Jan-2021 00:08:07 #24 53.55 compiling devicedbxmlreader.cpp
03-Jan-2021 00:08:07 #24 53.56 compiling devicequirks.cpp
03-Jan-2021 00:08:07 #24 53.56 compiling commandclasslist.cpp
03-Jan-2021 00:08:07 #24 53.57 compiling domitem.cpp
03-Jan-2021 00:08:07 #24 53.57 compiling dommodel.cpp
03-Jan-2021 00:08:07 #24 53.58 compiling widgetmapper.cpp
03-Jan-2021 00:08:07 #24 53.59 generating ./moc_predefs.h
03-Jan-2021 00:08:08 #24 54.75 moc deviceconfigxmlreader.h
03-Jan-2021 00:08:08 #24 54.77 moc devicequirks.h
03-Jan-2021 00:08:08 #24 54.77 moc devicedb.hpp
03-Jan-2021 00:08:08 #24 54.79 moc devicedbxmlreader.hpp
03-Jan-2021 00:08:09 #24 55.93 moc dommodel.h
03-Jan-2021 00:08:10 #24 56.64 moc widgetmapper.h
03-Jan-2021 00:08:10 #24 56.73 compiling moc_deviceconfigxmlreader.cpp
03-Jan-2021 00:08:10 #24 56.84 compiling moc_devicequirks.cpp
03-Jan-2021 00:08:10 #24 56.87 compiling moc_devicedb.cpp
03-Jan-2021 00:08:11 #24 57.64 compiling moc_devicedbxmlreader.cpp
03-Jan-2021 00:08:12 #24 58.10 compiling moc_dommodel.cpp
03-Jan-2021 00:08:12 #24 58.11 compiling moc_widgetmapper.cpp
03-Jan-2021 00:08:17 #24 63.54 devicedbxmlreader.cpp: In member function 'void DeviceDBXMLReader::updateDomElement(QTreeWidgetItem*, int)':
03-Jan-2021 00:08:17 #24 63.54 devicedbxmlreader.cpp:78:59: warning: unused parameter 'item' [-Wunused-parameter]
03-Jan-2021 00:08:17 #24 63.54 devicedbxmlreader.cpp:78:69: warning: unused parameter 'column' [-Wunused-parameter]
03-Jan-2021 00:08:18 #24 64.70 devicedb.cpp: In member function 'void DeviceDB::doProductPage(QTreeWidgetItem*)':
03-Jan-2021 00:08:18 #24 64.70 devicedb.cpp:78:47: warning: unused parameter 'item' [-Wunused-parameter]
03-Jan-2021 00:08:21 #24 67.53 In file included from deviceconfigxmlreader.cpp:17:
03-Jan-2021 00:08:21 #24 67.53 deviceconfigxmlreader.h: In constructor 'DeviceConfigXMLReader::DeviceConfigXMLReader(QTabWidget*, QWidget*)':
03-Jan-2021 00:08:21 #24 67.53 deviceconfigxmlreader.h:62:17: warning: 'DeviceConfigXMLReader::tabWidget' will be initialized after [-Wreorder]
03-Jan-2021 00:08:21 #24 67.53 deviceconfigxmlreader.cpp:28:45: warning:   base 'QObject' [-Wreorder]
03-Jan-2021 00:08:21 #24 67.53 deviceconfigxmlreader.cpp:27:1: warning:   when initialized here [-Wreorder]
03-Jan-2021 00:08:21 #24 67.53 rm -f libdevicedb-lib.a
03-Jan-2021 00:08:21 #24 67.54 ar cqs libdevicedb-lib.a deviceconfigxmlreader.o devicedb.o devicedbxmlreader.o devicequirks.o commandclasslist.o domitem.o dommodel.o widgetmapper.o moc_deviceconfigxmlreader.o moc_devicequirks.o moc_devicedb.o moc_devicedbxmlreader.o moc_dommodel.o moc_widgetmapper.o
03-Jan-2021 00:08:21 #24 67.55 make[1]: Leaving directory '/opt/ozw-admin/devicedb-lib'
03-Jan-2021 00:08:21 #24 67.55 cd ozwadmin-main/ && ( test -e Makefile || /opt/qt/5.12.9/bin/qmake -o Makefile /opt/ozw-admin/ozwadmin-main/ozwadmin-main.pro CONFIG+=release ) && make -f Makefile
03-Jan-2021 00:08:21 #24 67.78 make[1]: Entering directory '/opt/ozw-admin/ozwadmin-main'
03-Jan-2021 00:08:21 #24 67.78 uic mainwindow.ui
03-Jan-2021 00:08:21 #24 67.78 uic configuration.ui
03-Jan-2021 00:08:21 #24 67.80 uic deviceinfo.ui
03-Jan-2021 00:08:21 #24 67.80 uic eventwindow.ui
03-Jan-2021 00:08:21 #24 67.80 uic logwindow.ui
03-Jan-2021 00:08:21 #24 67.81 uic metadatawindow.ui
03-Jan-2021 00:08:21 #24 67.82 uic nodestatus.ui
03-Jan-2021 00:08:21 #24 67.82 uic nodetablewidget.ui
03-Jan-2021 00:08:21 #24 67.82 uic splashdialog.ui
03-Jan-2021 00:08:21 #24 67.82 uic startup.ui
03-Jan-2021 00:08:21 #24 67.82 uic startupprogress.ui
03-Jan-2021 00:08:21 #24 67.90 compiling main.cpp
03-Jan-2021 00:08:21 #24 67.91 compiling configuration.cpp
03-Jan-2021 00:08:21 #24 67.92 compiling controllercommands.cpp
03-Jan-2021 00:08:21 #24 67.92 compiling deviceinfo.cpp
03-Jan-2021 00:08:21 #24 67.92 compiling eventwindow.cpp
03-Jan-2021 00:08:21 #24 67.93 compiling logwindow.cpp
03-Jan-2021 00:08:21 #24 67.96 compiling mainwindow.cpp
03-Jan-2021 00:08:21 #24 67.96 compiling metadatawindow.cpp
03-Jan-2021 00:08:21 #24 67.96 compiling nodestatus.cpp
03-Jan-2021 00:08:21 #24 67.99 compiling nodetablewidget.cpp
03-Jan-2021 00:08:21 #24 68.01 compiling ozwcore.cpp
03-Jan-2021 00:08:22 #24 68.03 compiling splashdialog.cpp
03-Jan-2021 00:08:26 #24 72.19 compiling startup.cpp
03-Jan-2021 00:08:30 #24 76.51 compiling startupprogress.cpp
03-Jan-2021 00:08:30 #24 76.84 compiling statusbarmessages.cpp
03-Jan-2021 00:08:31 #24 77.27 compiling util.cpp
03-Jan-2021 00:08:31 #24 77.59 compiling valuetable.cpp
03-Jan-2021 00:08:31 #24 77.60 deviceinfo.cpp: In member function 'void DeviceInfo::NodeSelected(QModelIndex, QModelIndex)':
03-Jan-2021 00:08:31 #24 77.60 deviceinfo.cpp:39:64: warning: unused parameter 'previous' [-Wunused-parameter]
03-Jan-2021 00:08:31 #24 77.60 At global scope:
03-Jan-2021 00:08:31 #24 77.60 cc1plus: warning: unrecognized command line option '-Wno-deprecated-copy'
03-Jan-2021 00:08:31 #24 77.65 rcc ozwadmin-main.qrc
03-Jan-2021 00:08:31 #24 77.88 rcc stylesheets/darkorange/darkorange.qrc
03-Jan-2021 00:08:31 #24 77.92 generating ./moc_predefs.h
03-Jan-2021 00:08:32 #24 78.05 compiling qrc_ozwadmin-main.cpp
03-Jan-2021 00:08:32 #24 78.24 compiling qrc_darkorange.cpp
03-Jan-2021 00:08:32 #24 78.34 moc mainwindow.h
03-Jan-2021 00:08:32 #24 78.40 moc configuration.h
03-Jan-2021 00:08:32 #24 78.47 moc controllercommands.h
03-Jan-2021 00:08:32 #24 78.55 moc deviceinfo.h
03-Jan-2021 00:08:33 #24 79.60 moc eventwindow.h
03-Jan-2021 00:08:34 #24 80.12 moc logwindow.h
03-Jan-2021 00:08:34 #24 80.16 moc metadatawindow.h
03-Jan-2021 00:08:34 #24 80.27 moc nodestatus.h
03-Jan-2021 00:08:34 #24 80.52 moc nodetablewidget.h
03-Jan-2021 00:08:34 #24 80.53 moc ozwcore.h
03-Jan-2021 00:08:34 #24 80.60 moc splashdialog.h
03-Jan-2021 00:08:34 #24 80.86 moc startup.h
03-Jan-2021 00:08:35 #24 81.09 moc startupprogress.h
03-Jan-2021 00:08:35 #24 81.17 moc statusbarmessages.h
03-Jan-2021 00:08:35 #24 81.58 compiling moc_mainwindow.cpp
03-Jan-2021 00:08:35 #24 81.86 compiling moc_configuration.cpp
03-Jan-2021 00:08:36 #24 82.36 compiling moc_controllercommands.cpp
03-Jan-2021 00:08:36 #24 82.40 compiling moc_deviceinfo.cpp
03-Jan-2021 00:08:36 #24 82.54 compiling moc_eventwindow.cpp
03-Jan-2021 00:08:36 #24 82.54 compiling moc_metadatawindow.cpp
03-Jan-2021 00:08:37 #24 83.12 compiling moc_nodestatus.cpp
03-Jan-2021 00:08:37 #24 83.67 compiling moc_nodetablewidget.cpp
03-Jan-2021 00:08:37 #24 83.80 compiling moc_ozwcore.cpp
03-Jan-2021 00:08:37 #24 84.02 compiling moc_splashdialog.cpp
03-Jan-2021 00:08:39 #24 85.15 compiling moc_startup.cpp
03-Jan-2021 00:08:39 #24 85.36 compiling moc_startupprogress.cpp
03-Jan-2021 00:08:40 #24 86.34 compiling moc_statusbarmessages.cpp
03-Jan-2021 00:08:41 #24 87.12 compiling moc_logwindow.cpp
03-Jan-2021 00:08:47 #24 93.53 linking ../ozwadmin
03-Jan-2021 00:08:48 #24 94.83 make[1]: Leaving directory '/opt/ozw-admin/ozwadmin-main'
03-Jan-2021 00:08:48 #24 94.98 cd ozwadmin-widgets/ && ( test -e Makefile || /opt/qt/5.12.9/bin/qmake -o Makefile /opt/ozw-admin/ozwadmin-widgets/ozwadmin-widgets.pro CONFIG+=release ) && make -f Makefile install
03-Jan-2021 00:08:49 #24 95.18 make[1]: Entering directory '/opt/ozw-admin/ozwadmin-widgets'
03-Jan-2021 00:08:49 #24 95.18 make[1]: Nothing to be done for 'install'.
03-Jan-2021 00:08:49 #24 95.18 make[1]: Leaving directory '/opt/ozw-admin/ozwadmin-widgets'
03-Jan-2021 00:08:49 #24 95.19 cd devicedb-lib/ && ( test -e Makefile || /opt/qt/5.12.9/bin/qmake -o Makefile /opt/ozw-admin/devicedb-lib/devicedb-lib.pro CONFIG+=release ) && make -f Makefile install
03-Jan-2021 00:08:49 #24 95.37 make[1]: Entering directory '/opt/ozw-admin/devicedb-lib'
03-Jan-2021 00:08:49 #24 95.37 make[1]: Nothing to be done for 'install'.
03-Jan-2021 00:08:49 #24 95.37 make[1]: Leaving directory '/opt/ozw-admin/devicedb-lib'
03-Jan-2021 00:08:49 #24 95.38 cd ozwadmin-main/ && ( test -e Makefile || /opt/qt/5.12.9/bin/qmake -o Makefile /opt/ozw-admin/ozwadmin-main/ozwadmin-main.pro CONFIG+=release ) && make -f Makefile install
03-Jan-2021 00:08:49 #24 95.72 make[1]: Entering directory '/opt/ozw-admin/ozwadmin-main'
03-Jan-2021 00:08:49 #24 95.72 /opt/qt/5.12.9/bin/qmake -install qinstall -exe ../ozwadmin /usr/local/bin/ozwadmin
03-Jan-2021 00:08:49 #24 95.74 strip /usr/local/bin/ozwadmin
03-Jan-2021 00:08:49 #24 95.76 make[1]: Leaving directory '/opt/ozw-admin/ozwadmin-main'
03-Jan-2021 00:08:50 #24 DONE 96.1s
03-Jan-2021 00:08:56
03-Jan-2021 00:08:56 #25 [base 5/12] COPY --from=builder /usr/local/bin/ozwdaemon /usr/local/bin/...
03-Jan-2021 00:08:56 #25 DONE 0.5s
03-Jan-2021 00:08:56
03-Jan-2021 00:08:56 #26 [base 6/12] COPY --from=builder /usr/local/lib/libopenzwave.so.1.6 /usr/...
03-Jan-2021 00:08:57 #26 DONE 0.3s
03-Jan-2021 00:08:58
03-Jan-2021 00:08:58 #27 [base 7/12] COPY --from=builder /opt/qt/5.12.9/lib/libQt5Core* /opt/qt/5...
03-Jan-2021 00:08:59 #27 DONE 1.4s
03-Jan-2021 00:08:59
03-Jan-2021 00:08:59 #28 [base 8/12] COPY --from=builder /opt/qt/5.12.9/lib/libqt-openzwave* /opt...
03-Jan-2021 00:09:00 #28 DONE 0.7s
03-Jan-2021 00:09:00
03-Jan-2021 00:09:00 #29 [base 9/12] COPY --from=builder /opt/qt/5.12.9/qt-openzwavedatabase.rcc ...
03-Jan-2021 00:09:00 #29 DONE 0.3s
03-Jan-2021 00:09:00
03-Jan-2021 00:09:00 #30 [base 10/12] COPY Docker/base/ /
03-Jan-2021 00:09:00 #30 DONE 0.2s
03-Jan-2021 00:09:00
03-Jan-2021 00:09:00 #31 [base 11/12] RUN ldconfig -v
03-Jan-2021 00:09:01 #31 1.120 ldconfig: Can't stat /usr/local/lib/arm-linux-gnueabihf: No such file or directory
03-Jan-2021 00:09:01 #31 1.120 ldconfig: Path `/lib/arm-linux-gnueabihf' given more than once
03-Jan-2021 00:09:01 #31 1.120 ldconfig: Path `/usr/lib/arm-linux-gnueabihf' given more than once
03-Jan-2021 00:09:01 #31 1.123 ldconfig: /lib/arm-linux-gnueabihf/ld-2.28.so is the dynamic linker, ignoring
03-Jan-2021 00:09:01 #31 1.123
03-Jan-2021 00:09:01 #31 1.123 /lib/arm-linux-gnueabihf:
03-Jan-2021 00:09:01 #31 1.123         libkeyutils.so.1 -> libkeyutils.so.1.8
03-Jan-2021 00:09:01 #31 1.123         libz.so.1 -> libz.so.1.2.11
03-Jan-2021 00:09:01 #31 1.123         libuuid.so.1 -> libuuid.so.1.3.0
03-Jan-2021 00:09:01 #31 1.123         libutil.so.1 -> libutil-2.28.so
03-Jan-2021 00:09:01 #31 1.123         libudev.so.1 -> libudev.so.1.6.13
03-Jan-2021 00:09:01 #31 1.123         libtinfo.so.6 -> libtinfo.so.6.1
03-Jan-2021 00:09:01 #31 1.123         libthread_db.so.1 -> libthread_db-1.0.so
03-Jan-2021 00:09:01 #31 1.123         libsystemd.so.0 -> libsystemd.so.0.25.0
03-Jan-2021 00:09:01 #31 1.123         libss.so.2 -> libss.so.2.0
03-Jan-2021 00:09:01 #31 1.123         libsmartcols.so.1 -> libsmartcols.so.1.1.0
03-Jan-2021 00:09:01 #31 1.123         libsepol.so.1 -> libsepol.so.1
03-Jan-2021 00:09:01 #31 1.123         libselinux.so.1 -> libselinux.so.1
03-Jan-2021 00:09:01 #31 1.123         librt.so.1 -> librt-2.28.so
03-Jan-2021 00:09:01 #31 1.123         libresolv.so.2 -> libresolv-2.28.so
03-Jan-2021 00:09:01 #31 1.123         libpthread.so.0 -> libpthread-2.28.so
03-Jan-2021 00:09:01 #31 1.123         libpcre.so.3 -> libpcre.so.3.13.3
03-Jan-2021 00:09:01 #31 1.123         libpcprofile.so -> libpcprofile.so
03-Jan-2021 00:09:01 #31 1.123         libpamc.so.0 -> libpamc.so.0.82.1
03-Jan-2021 00:09:01 #31 1.123         libpam_misc.so.0 -> libpam_misc.so.0.82.1
03-Jan-2021 00:09:01 #31 1.123         libpam.so.0 -> libpam.so.0.84.2
03-Jan-2021 00:09:01 #31 1.123         libnss_nisplus.so.2 -> libnss_nisplus-2.28.so
03-Jan-2021 00:09:01 #31 1.123         libnss_nis.so.2 -> libnss_nis-2.28.so
03-Jan-2021 00:09:01 #31 1.123         libnss_hesiod.so.2 -> libnss_hesiod-2.28.so
03-Jan-2021 00:09:01 #31 1.123         libnss_files.so.2 -> libnss_files-2.28.so
03-Jan-2021 00:09:01 #31 1.123         libnss_dns.so.2 -> libnss_dns-2.28.so
03-Jan-2021 00:09:01 #31 1.123         libnss_compat.so.2 -> libnss_compat-2.28.so
03-Jan-2021 00:09:01 #31 1.123         libnsl.so.1 -> libnsl-2.28.so
03-Jan-2021 00:09:01 #31 1.123         libncursesw.so.6 -> libncursesw.so.6.1
03-Jan-2021 00:09:01 #31 1.123         libmount.so.1 -> libmount.so.1.1.0
03-Jan-2021 00:09:01 #31 1.123         libmemusage.so -> libmemusage.so
03-Jan-2021 00:09:01 #31 1.123         libm.so.6 -> libm-2.28.so
03-Jan-2021 00:09:01 #31 1.123         liblzma.so.5 -> liblzma.so.5.2.4
03-Jan-2021 00:09:01 #31 1.123         libgpg-error.so.0 -> libgpg-error.so.0.26.1
03-Jan-2021 00:09:01 #31 1.123         libgcrypt.so.20 -> libgcrypt.so.20.2.4
03-Jan-2021 00:09:01 #31 1.123         libgcc_s.so.1 -> libgcc_s.so.1
03-Jan-2021 00:09:01 #31 1.123         libfdisk.so.1 -> libfdisk.so.1.1.0
03-Jan-2021 00:09:01 #31 1.123         libext2fs.so.2 -> libext2fs.so.2.4
03-Jan-2021 00:09:01 #31 1.123         libe2p.so.2 -> libe2p.so.2.3
03-Jan-2021 00:09:01 #31 1.123         libdl.so.2 -> libdl-2.28.so
03-Jan-2021 00:09:01 #31 1.123         libcrypt.so.1 -> libcrypt-2.28.so
03-Jan-2021 00:09:01 #31 1.123         libcom_err.so.2 -> libcom_err.so.2.1
03-Jan-2021 00:09:01 #31 1.123         libcap-ng.so.0 -> libcap-ng.so.0.0.0
03-Jan-2021 00:09:01 #31 1.123         libc.so.6 -> libc-2.28.so
03-Jan-2021 00:09:01 #31 1.123         libbz2.so.1.0 -> libbz2.so.1.0.4
03-Jan-2021 00:09:01 #31 1.123         libblkid.so.1 -> libblkid.so.1.1.0
03-Jan-2021 00:09:01 #31 1.123         libaudit.so.1 -> libaudit.so.1.0.0
03-Jan-2021 00:09:01 #31 1.123         libanl.so.1 -> libanl-2.28.so
03-Jan-2021 00:09:01 #31 1.123         libSegFault.so -> libSegFault.so
03-Jan-2021 00:09:01 #31 1.123         libBrokenLocale.so.1 -> libBrokenLocale-2.28.so
03-Jan-2021 00:09:01 #31 1.131         ld-linux-armhf.so.3 -> ld-2.28.so
03-Jan-2021 00:09:01 #31 1.131 /usr/lib/arm-linux-gnueabihf:
03-Jan-2021 00:09:01 #31 1.131         libgmodule-2.0.so.0 -> libgmodule-2.0.so.0.5800.3
03-Jan-2021 00:09:01 #31 1.131         libglib-2.0.so.0 -> libglib-2.0.so.0.5800.3
03-Jan-2021 00:09:01 #31 1.131         libgio-2.0.so.0 -> libgio-2.0.so.0.5800.3
03-Jan-2021 00:09:01 #31 1.131         libicuio.so.63 -> libicuio.so.63.1
03-Jan-2021 00:09:01 #31 1.131         libicui18n.so.63 -> libicui18n.so.63.1
03-Jan-2021 00:09:01 #31 1.131         libicudata.so.63 -> libicudata.so.63.1
03-Jan-2021 00:09:01 #31 1.131         libgthread-2.0.so.0 -> libgthread-2.0.so.0.5800.3
03-Jan-2021 00:09:01 #31 1.131         libgobject-2.0.so.0 -> libgobject-2.0.so.0.5800.3
03-Jan-2021 00:09:01 #31 1.131         libcurl.so.4 -> libcurl.so.4.5.0
03-Jan-2021 00:09:01 #31 1.131         libssh2.so.1 -> libssh2.so.1.0.1
03-Jan-2021 00:09:01 #31 1.131         librtmp.so.1 -> librtmp.so.1
03-Jan-2021 00:09:01 #31 1.131         libnghttp2.so.14 -> libnghttp2.so.14.17.1
03-Jan-2021 00:09:01 #31 1.131         libldap_r-2.4.so.2 -> libldap_r-2.4.so.2.10.10
03-Jan-2021 00:09:01 #31 1.131         liblber-2.4.so.2 -> liblber-2.4.so.2.10.10
03-Jan-2021 00:09:01 #31 1.131         libicuuc.so.63 -> libicuuc.so.63.1
03-Jan-2021 00:09:01 #31 1.131         libunwind-coredump.so.0 -> libunwind-coredump.so.0.0.0
03-Jan-2021 00:09:01 #31 1.131         libsasl2.so.2 -> libsasl2.so.2.0.25
03-Jan-2021 00:09:01 #31 1.131         libunwind-arm.so.8 -> libunwind-arm.so.8.0.1
03-Jan-2021 00:09:01 #31 1.131         libgssapi_krb5.so.2 -> libgssapi_krb5.so.2.2
03-Jan-2021 00:09:01 #31 1.131         libkrb5.so.3 -> libkrb5.so.3.3
03-Jan-2021 00:09:01 #31 1.131         libk5crypto.so.3 -> libk5crypto.so.3.1
03-Jan-2021 00:09:01 #31 1.131         libxml2.so.2 -> libxml2.so.2.9.4
03-Jan-2021 00:09:01 #31 1.131         libkrb5support.so.0 -> libkrb5support.so.0.1
03-Jan-2021 00:09:01 #31 1.131         libicutu.so.63 -> libicutu.so.63.1
03-Jan-2021 00:09:01 #31 1.131         libicutest.so.63 -> libicutest.so.63.1
03-Jan-2021 00:09:01 #31 1.131         libpsl.so.5 -> libpsl.so.5.3.1
03-Jan-2021 00:09:01 #31 1.131         libpcre2-8.so.0 -> libpcre2-8.so.0.7.1
03-Jan-2021 00:09:01 #31 1.131         libunwind.so.8 -> libunwind.so.8.0.1
03-Jan-2021 00:09:01 #31 1.131         libssl.so.1.1 -> libssl.so.1.1
03-Jan-2021 00:09:01 #31 1.131         libcrypto.so.1.1 -> libcrypto.so.1.1
03-Jan-2021 00:09:01 #31 1.131         libunwind-ptrace.so.0 -> libunwind-ptrace.so.0.0.0
03-Jan-2021 00:09:01 #31 1.131         libzstd.so.1 -> libzstd.so.1.3.8
03-Jan-2021 00:09:01 #31 1.131         libunistring.so.2 -> libunistring.so.2.1.0
03-Jan-2021 00:09:01 #31 1.131         libtic.so.6 -> libtic.so.6.1
03-Jan-2021 00:09:01 #31 1.131         libtasn1.so.6 -> libtasn1.so.6.5.5
03-Jan-2021 00:09:01 #31 1.131         libstdc++.so.6 -> libstdc++.so.6.0.25
03-Jan-2021 00:09:01 #31 1.131         libsemanage.so.1 -> libsemanage.so.1
03-Jan-2021 00:09:01 #31 1.131         libseccomp.so.2 -> libseccomp.so.2.3.3
03-Jan-2021 00:09:01 #31 1.131         libpcreposix.so.3 -> libpcreposix.so.3.13.3
03-Jan-2021 00:09:01 #31 1.131         libpanelw.so.6 -> libpanelw.so.6.1
03-Jan-2021 00:09:01 #31 1.131         libp11-kit.so.0 -> libp11-kit.so.0.3.0
03-Jan-2021 00:09:01 #31 1.131         libnettle.so.6 -> libnettle.so.6.5
03-Jan-2021 00:09:01 #31 1.131         libmenuw.so.6 -> libmenuw.so.6.1
03-Jan-2021 00:09:01 #31 1.131         liblz4.so.1 -> liblz4.so.1.8.3
03-Jan-2021 00:09:01 #31 1.131         libidn2.so.0 -> libidn2.so.0.3.4
03-Jan-2021 00:09:01 #31 1.131         libhogweed.so.4 -> libhogweed.so.4.5
03-Jan-2021 00:09:01 #31 1.131         libgnutls.so.30 -> libgnutls.so.30.23.2
03-Jan-2021 00:09:01 #31 1.131         libgmp.so.10 -> libgmp.so.10.3.2
03-Jan-2021 00:09:01 #31 1.131         libformw.so.6 -> libformw.so.6.1
03-Jan-2021 00:09:01 #31 1.131         libffi.so.6 -> libffi.so.6.0.4
03-Jan-2021 00:09:01 #31 1.131         libdebconfclient.so.0 -> libdebconfclient.so.0.0.0
03-Jan-2021 00:09:01 #31 1.131         libdb-5.3.so -> libdb-5.3.so
03-Jan-2021 00:09:01 #31 1.131         libattr.so.1 -> libattr.so.1.1.2448
03-Jan-2021 00:09:01 #31 1.131         libapt-private.so.0.0 -> libapt-private.so.0.0.0
03-Jan-2021 00:09:01 #31 1.131         libapt-pkg.so.5.0 -> libapt-pkg.so.5.0.2
03-Jan-2021 00:09:01 #31 1.131         libacl.so.1 -> libacl.so.1.1.2253
03-Jan-2021 00:09:01 #31 1.131 /usr/local/lib:
03-Jan-2021 00:09:01 #31 1.131         libopenzwave.so.1.6 -> libopenzwave.so.1.6
03-Jan-2021 00:09:01 #31 1.131 /lib:
03-Jan-2021 00:09:01 #31 1.131 /usr/lib:
03-Jan-2021 00:09:01 #31 DONE 1.3s
03-Jan-2021 00:09:01
03-Jan-2021 00:09:01 #32 [base 12/12] WORKDIR /opt/ozw/
03-Jan-2021 00:09:01 #32 DONE 0.1s
03-Jan-2021 00:09:02
03-Jan-2021 00:09:02 #33 exporting to image
03-Jan-2021 00:09:02 #33 exporting layers
03-Jan-2021 00:09:05 #33 exporting layers 3.3s done
03-Jan-2021 00:09:05 #33 writing image sha256:5087cedf68844392b1c5441c797534a1ccd6b634957d13eb5a977fa3ca09c2f1 done
03-Jan-2021 00:09:05 #33 naming to docker.io/openzwave/ozwdaemon:armhf-183 done
03-Jan-2021 00:09:05 #33 DONE 3.3s
03-Jan-2021 00:09:19 #2 [internal] load .dockerignore
03-Jan-2021 00:09:19 #2 transferring context: 35B done
03-Jan-2021 00:09:19 #2 DONE 0.0s
03-Jan-2021 00:09:19
03-Jan-2021 00:09:19 #1 [internal] load build definition from Dockerfile
03-Jan-2021 00:09:19 #1 transferring dockerfile: 38B done
03-Jan-2021 00:09:19 #1 DONE 0.1s
03-Jan-2021 00:09:20
03-Jan-2021 00:09:20 #4 [internal] load metadata for docker.io/fishwaldo/ozw-base:5.12.9
03-Jan-2021 00:09:22 #4 DONE 2.5s
03-Jan-2021 00:09:22
03-Jan-2021 00:09:22 #3 [internal] load metadata for docker.io/library/debian:buster-slim
03-Jan-2021 00:09:22 #3 DONE 2.4s
03-Jan-2021 00:09:22
03-Jan-2021 00:09:22 #9 [builder 1/15] FROM docker.io/fishwaldo/ozw-base:5.12.9@sha256:f5f16cda5...
03-Jan-2021 00:09:22 #9 DONE 0.0s
03-Jan-2021 00:09:22
03-Jan-2021 00:09:22 #5 [base 1/12] FROM docker.io/library/debian:buster-slim@sha256:240f770008b...
03-Jan-2021 00:09:22 #5 DONE 0.0s
03-Jan-2021 00:09:22
03-Jan-2021 00:09:22 #10 [builder 2/15] WORKDIR /opt
03-Jan-2021 00:09:22 #10 CACHED
03-Jan-2021 00:09:22
03-Jan-2021 00:09:22 #11 [builder 3/15] RUN apt update && apt-get -y install rapidjson-dev cmake ...
03-Jan-2021 00:09:22 #11 CACHED
03-Jan-2021 00:09:22
03-Jan-2021 00:09:22 #15 [internal] load build context
03-Jan-2021 00:09:22 #15 transferring context: 11.94kB 0.1s done
03-Jan-2021 00:09:22 #15 DONE 0.2s
03-Jan-2021 00:09:22
03-Jan-2021 00:09:22 #12 [builder 4/15] RUN if [ -n "armhf-1.dmz.dynam.ac
03-Jan-2021 00:09:22 armhf-3.dmz.dynam.ac
03-Jan-2021 00:09:22 ar...
03-Jan-2021 00:09:23 #12 ...
03-Jan-2021 00:09:23
03-Jan-2021 00:09:23 #35 https://github.com/novnc/noVNC/archive/v1.2.0.tar.gz
03-Jan-2021 00:09:23 #35 DONE 0.8s
03-Jan-2021 00:09:23
03-Jan-2021 00:09:23 #33 https://github.com/novnc/websockify/archive/v0.9.0.tar.gz
03-Jan-2021 00:09:23 #33 DONE 0.8s
03-Jan-2021 00:09:23
03-Jan-2021 00:09:23 #12 [builder 4/15] RUN if [ -n "armhf-1.dmz.dynam.ac
03-Jan-2021 00:09:23 armhf-3.dmz.dynam.ac
03-Jan-2021 00:09:23 ar...
03-Jan-2021 00:09:23 #12 1.150 Using DistCC hosts armhf-1.dmz.dynam.ac
03-Jan-2021 00:09:23 #12 1.150 armhf-3.dmz.dynam.ac
03-Jan-2021 00:09:23 #12 1.150 armhf-4.dmz.dynam.ac
03-Jan-2021 00:09:23 #12 1.150 armhf-2.dmz.dynam.ac
03-Jan-2021 00:09:23 #12 1.150 armhf-5.dmz.dynam.ac
03-Jan-2021 00:09:23 #12 1.150 armhf-6.dmz.dynam.ac
03-Jan-2021 00:09:23 #12 DONE 1.3s
03-Jan-2021 00:09:23
03-Jan-2021 00:09:23 #13 [builder 5/15] RUN git clone https://chromium.googlesource.com/chromium/...
03-Jan-2021 00:09:25 #13 1.255 Cloning into 'depot_tools'...
03-Jan-2021 00:09:32 #13 8.244 Note: checking out '464e9ff'.
03-Jan-2021 00:09:32 #13 8.244
03-Jan-2021 00:09:32 #13 8.244 You are in 'detached HEAD' state. You can look around, make experimental
03-Jan-2021 00:09:32 #13 8.244 changes and commit them, and you can discard any commits you make in this
03-Jan-2021 00:09:32 #13 8.244 state without impacting any branches by performing another checkout.
03-Jan-2021 00:09:32 #13 8.244
03-Jan-2021 00:09:32 #13 8.244 If you want to create a new branch to retain commits you create, you may
03-Jan-2021 00:09:32 #13 8.244 do so (now or later) by using -b with the checkout command again. Example:
03-Jan-2021 00:09:32 #13 8.244
03-Jan-2021 00:09:32 #13 8.244   git checkout -b <new-branch-name>
03-Jan-2021 00:09:32 #13 8.244
03-Jan-2021 00:09:32 #13 8.244 HEAD is now at 464e9ff4 Add support for git_cl_tests on Windows platform
03-Jan-2021 00:10:12 #13 48.60 WARNING: Your metrics.cfg file was invalid or nonexistent. A new one will be created.
03-Jan-2021 00:10:21 #13 56.99
03-Jan-2021 00:10:21 #13 56.99 ________ running 'git -c core.deltaBaseCacheLimit=512m clone --no-checkout --progress https://chromium.googlesource.com/breakpad/breakpad.git /opt/breakpad/_gclient_src_zv0pWh' in '/opt/breakpad'
03-Jan-2021 00:10:21 #13 56.99 Cloning into '/opt/breakpad/_gclient_src_zv0pWh'...
03-Jan-2021 00:10:21 #13 56.99 remote: Sending approximately 40.36 MiB ...       
03-Jan-2021 00:10:21 #13 56.99 Receiving objects:   0% (1/19346)   
03-Jan-2021 00:10:21 Receiving objects:   1% (194/19346)   
03-Jan-2021 00:10:21 Receiving objects:   2% (387/19346)   
03-Jan-2021 00:10:21 Receiving objects:   3% (581/19346)   
03-Jan-2021 00:10:21 Receiving objects:   4% (774/19346)   
03-Jan-2021 00:10:21 Receiving objects:   5% (968/19346)   
03-Jan-2021 00:10:21 Receiving objects:   6% (1161/19346)   
03-Jan-2021 00:10:21 Receiving objects:   7% (1355/19346)   
03-Jan-2021 00:10:21 Receiving objects:   8% (1548/19346)   
03-Jan-2021 00:10:21 Receiving objects:   9% (1742/19346)   
03-Jan-2021 00:10:21 Receiving objects:  10% (1935/19346)   
03-Jan-2021 00:10:21 Receiving objects:  11% (2129/19346)   
03-Jan-2021 00:10:21 Receiving objects:  12% (2322/19346)   
03-Jan-2021 00:10:21 Receiving objects:  13% (2515/19346)   
03-Jan-2021 00:10:21 Receiving objects:  14% (2709/19346)   
03-Jan-2021 00:10:21 Receiving objects:  15% (2902/19346)   
03-Jan-2021 00:10:21 Receiving objects:  16% (3096/19346)   
03-Jan-2021 00:10:21 Receiving objects:  17% (3289/19346)   
03-Jan-2021 00:10:21 Receiving objects:  18% (3483/19346)   
03-Jan-2021 00:10:21 Receiving objects:  19% (3676/19346)   
03-Jan-2021 00:10:21 Receiving objects:  20% (3870/19346)   
03-Jan-2021 00:10:21 Receiving objects:  21% (4063/19346)   
03-Jan-2021 00:10:21 Receiving objects:  22% (4257/19346)   
03-Jan-2021 00:10:21 Receiving objects:  23% (4450/19346)   
03-Jan-2021 00:10:21 Receiving objects:  24% (4644/19346)   
03-Jan-2021 00:10:21 Receiving objects:  25% (4837/19346)   
03-Jan-2021 00:10:21 Receiving objects:  26% (5030/19346)   
03-Jan-2021 00:10:21 Receiving objects:  27% (5224/19346)   
03-Jan-2021 00:10:21 Receiving objects:  28% (5417/19346)   
03-Jan-2021 00:10:21 Receiving objects:  29% (5611/19346)   
03-Jan-2021 00:10:21 Receiving objects:  30% (5804/19346)   
03-Jan-2021 00:10:21 Receiving objects:  31% (5998/19346)   
03-Jan-2021 00:10:21 Receiving objects:  32% (6191/19346)   
03-Jan-2021 00:10:21 Receiving objects:  33% (6385/19346)   
03-Jan-2021 00:10:21 Receiving objects:  34% (6578/19346)   
03-Jan-2021 00:10:21 Receiving objects:  35% (6772/19346)   
03-Jan-2021 00:10:21 Receiving objects:  36% (6965/19346)   
03-Jan-2021 00:10:21 Receiving objects:  37% (7159/19346)   
03-Jan-2021 00:10:21 Receiving objects:  38% (7352/19346)   
03-Jan-2021 00:10:21 Receiving objects:  39% (7545/19346)   
03-Jan-2021 00:10:21 Receiving objects:  40% (7739/19346)   
03-Jan-2021 00:10:21 Receiving objects:  41% (7932/19346)   
03-Jan-2021 00:10:21 Receiving objects:  42% (8126/19346)   
03-Jan-2021 00:10:21 Receiving objects:  43% (8319/19346)   
03-Jan-2021 00:10:21 Receiving objects:  44% (8513/19346)   
03-Jan-2021 00:10:21 Receiving objects:  45% (8706/19346)   
03-Jan-2021 00:10:21 Receiving objects:  46% (8900/19346)   
03-Jan-2021 00:10:21 Receiving objects:  47% (9093/19346)   
03-Jan-2021 00:10:21 Receiving objects:  48% (9287/19346)   
03-Jan-2021 00:10:21 Receiving objects:  49% (9480/19346)   
03-Jan-2021 00:10:21 Receiving objects:  50% (9673/19346)   
03-Jan-2021 00:10:21 Receiving objects:  51% (9867/19346)   
03-Jan-2021 00:10:21 Receiving objects:  52% (10060/19346)   
03-Jan-2021 00:10:21 Receiving objects:  53% (10254/19346)   
03-Jan-2021 00:10:21 Receiving objects:  54% (10447/19346)   
03-Jan-2021 00:10:21 Receiving objects:  55% (10641/19346)   
03-Jan-2021 00:10:21 Receiving objects:  56% (10834/19346)   
03-Jan-2021 00:10:21 Receiving objects:  57% (11028/19346)   
03-Jan-2021 00:10:21 Receiving objects:  58% (11221/19346)   
03-Jan-2021 00:10:21 Receiving objects:  59% (11415/19346)   
03-Jan-2021 00:10:21 Receiving objects:  60% (11608/19346)   
03-Jan-2021 00:10:21 Receiving objects:  61% (11802/19346)   
03-Jan-2021 00:10:21 Receiving objects:  62% (11995/19346)   
03-Jan-2021 00:10:21 Receiving objects:  63% (12188/19346)   
03-Jan-2021 00:10:21 Receiving objects:  64% (12382/19346)   
03-Jan-2021 00:10:21 Receiving objects:  65% (12575/19346)   
03-Jan-2021 00:10:21 Receiving objects:  66% (12769/19346)   
03-Jan-2021 00:10:21 Receiving objects:  67% (12962/19346)   
03-Jan-2021 00:10:21 Receiving objects:  68% (13156/19346), 4.61 MiB | 9.21 MiB/s   
03-Jan-2021 00:10:21 Receiving objects:  69% (13349/19346), 4.61 MiB | 9.21 MiB/s   
03-Jan-2021 00:10:21 Receiving objects:  70% (13543/19346), 4.61 MiB | 9.21 MiB/s   
03-Jan-2021 00:10:21 Receiving objects:  71% (13736/19346), 4.61 MiB | 9.21 MiB/s   
03-Jan-2021 00:10:21 Receiving objects:  72% (13930/19346), 4.61 MiB | 9.21 MiB/s   
03-Jan-2021 00:10:21 Receiving objects:  73% (14123/19346), 4.61 MiB | 9.21 MiB/s   
03-Jan-2021 00:10:21 Receiving objects:  73% (14141/19346), 4.61 MiB | 9.21 MiB/s   
03-Jan-2021 00:10:21 Receiving objects:  74% (14317/19346), 9.11 MiB | 9.11 MiB/s   
03-Jan-2021 00:10:21 Receiving objects:  75% (14510/19346), 9.11 MiB | 9.11 MiB/s   
03-Jan-2021 00:10:21 Receiving objects:  76% (14703/19346), 9.11 MiB | 9.11 MiB/s   
03-Jan-2021 00:10:21 Receiving objects:  77% (14897/19346), 9.11 MiB | 9.11 MiB/s   
03-Jan-2021 00:10:21 Receiving objects:  77% (15037/19346), 16.96 MiB | 8.48 MiB/s   
03-Jan-2021 00:10:21 Receiving objects:  77% (15037/19346), 24.99 MiB | 8.33 MiB/s   
03-Jan-2021 00:10:21 Receiving objects:  77% (15037/19346), 32.71 MiB | 8.18 MiB/s   
03-Jan-2021 00:10:21 Receiving objects:  77% (15037/19346), 36.72 MiB | 7.14 MiB/s   
03-Jan-2021 00:10:21 Receiving objects:  78% (15090/19346), 36.72 MiB | 7.14 MiB/s   
03-Jan-2021 00:10:21 Receiving objects:  79% (15284/19346), 36.72 MiB | 7.14 MiB/s   
03-Jan-2021 00:10:21 Receiving objects:  80% (15477/19346), 36.72 MiB | 7.14 MiB/s   
03-Jan-2021 00:10:21 Receiving objects:  81% (15671/19346), 36.72 MiB | 7.14 MiB/s   
03-Jan-2021 00:10:21 Receiving objects:  82% (15864/19346), 38.53 MiB | 6.54 MiB/s   
03-Jan-2021 00:10:21 Receiving objects:  83% (16058/19346), 38.53 MiB | 6.54 MiB/s   
03-Jan-2021 00:10:21 Receiving objects:  84% (16251/19346), 38.53 MiB | 6.54 MiB/s   
03-Jan-2021 00:10:21 Receiving objects:  85% (16445/19346), 38.53 MiB | 6.54 MiB/s   
03-Jan-2021 00:10:21 Receiving objects:  86% (16638/19346), 38.53 MiB | 6.54 MiB/s   
03-Jan-2021 00:10:21 Receiving objects:  87% (16832/19346), 38.53 MiB | 6.54 MiB/s   
03-Jan-2021 00:10:21 Receiving objects:  88% (17025/19346), 38.53 MiB | 6.54 MiB/s   
03-Jan-2021 00:10:21 Receiving objects:  89% (17218/19346), 38.53 MiB | 6.54 MiB/s   
03-Jan-2021 00:10:21 Receiving objects:  90% (17412/19346), 38.53 MiB | 6.54 MiB/s   
03-Jan-2021 00:10:21 Receiving objects:  91% (17605/19346), 38.53 MiB | 6.54 MiB/s   
03-Jan-2021 00:10:21 Receiving objects:  92% (17799/19346), 38.53 MiB | 6.54 MiB/s   
03-Jan-2021 00:10:21 Receiving objects:  93% (17992/19346), 38.53 MiB | 6.54 MiB/s   
03-Jan-2021 00:10:21 Receiving objects:  94% (18186/19346), 38.53 MiB | 6.54 MiB/s   
03-Jan-2021 00:10:21 Receiving objects:  95% (18379/19346), 38.53 MiB | 6.54 MiB/s   
03-Jan-2021 00:10:21 Receiving objects:  96% (18573/19346), 38.53 MiB | 6.54 MiB/s   
03-Jan-2021 00:10:21 Receiving objects:  97% (18766/19346), 38.53 MiB | 6.54 MiB/s   
03-Jan-2021 00:10:21 Receiving objects:  98% (18960/19346), 38.53 MiB | 6.54 MiB/s   
03-Jan-2021 00:10:21 Receiving objects:  99% (19153/19346), 38.53 MiB | 6.54 MiB/s   
03-Jan-2021 00:10:21 remote: Total 19346 (delta 15024), reused 19346 (delta 15024)       
03-Jan-2021 00:10:21 #13 57.69 Receiving objects: 100% (19346/19346), 38.53 MiB | 6.54 MiB/s   
03-Jan-2021 00:10:21 Receiving objects: 100% (19346/19346), 40.36 MiB | 7.13 MiB/s, done.
03-Jan-2021 00:10:21 #13 57.69 Resolving deltas:   0% (0/15024)   
03-Jan-2021 00:10:21 Resolving deltas:   1% (162/15024)   
03-Jan-2021 00:10:21 Resolving deltas:   2% (309/15024)   
03-Jan-2021 00:10:21 Resolving deltas:   3% (467/15024)   
03-Jan-2021 00:10:21 Resolving deltas:   4% (605/15024)   
03-Jan-2021 00:10:21 Resolving deltas:   5% (753/15024)   
03-Jan-2021 00:10:21 Resolving deltas:   6% (902/15024)   
03-Jan-2021 00:10:21 Resolving deltas:   7% (1053/15024)   
03-Jan-2021 00:10:21 Resolving deltas:   8% (1203/15024)   
03-Jan-2021 00:10:21 Resolving deltas:   9% (1353/15024)   
03-Jan-2021 00:10:21 Resolving deltas:  10% (1503/15024)   
03-Jan-2021 00:10:21 Resolving deltas:  11% (1686/15024)   
03-Jan-2021 00:10:21 Resolving deltas:  12% (1816/15024)   
03-Jan-2021 00:10:21 Resolving deltas:  14% (2150/15024)   
03-Jan-2021 00:10:21 Resolving deltas:  15% (2371/15024)   
03-Jan-2021 00:10:21 Resolving deltas:  17% (2609/15024)   
03-Jan-2021 00:10:21 Resolving deltas:  18% (2715/15024)   
03-Jan-2021 00:10:21 Resolving deltas:  19% (2948/15024)   
03-Jan-2021 00:10:21 Resolving deltas:  20% (3019/15024)   
03-Jan-2021 00:10:21 Resolving deltas:  21% (3169/15024)   
03-Jan-2021 00:10:21 Resolving deltas:  22% (3332/15024)   
03-Jan-2021 00:10:21 Resolving deltas:  23% (3477/15024)   
03-Jan-2021 00:10:21 Resolving deltas:  24% (3664/15024)   
03-Jan-2021 00:10:21 Resolving deltas:  25% (3779/15024)   
03-Jan-2021 00:10:21 Resolving deltas:  26% (3933/15024)   
03-Jan-2021 00:10:21 Resolving deltas:  27% (4068/15024)   
03-Jan-2021 00:10:21 Resolving deltas:  28% (4225/15024)   
03-Jan-2021 00:10:21 Resolving deltas:  29% (4381/15024)   
03-Jan-2021 00:10:21 Resolving deltas:  30% (4633/15024)   
03-Jan-2021 00:10:21 Resolving deltas:  32% (4813/15024)   
03-Jan-2021 00:10:21 Resolving deltas:  33% (4958/15024)   
03-Jan-2021 00:10:21 Resolving deltas:  34% (5121/15024)   
03-Jan-2021 00:10:21 Resolving deltas:  36% (5430/15024)   
03-Jan-2021 00:10:21 Resolving deltas:  37% (5580/15024)   
03-Jan-2021 00:10:21 Resolving deltas:  38% (5741/15024)   
03-Jan-2021 00:10:21 Resolving deltas:  39% (5870/15024)   
03-Jan-2021 00:10:21 Resolving deltas:  40% (6020/15024)   
03-Jan-2021 00:10:21 Resolving deltas:  41% (6181/15024)   
03-Jan-2021 00:10:21 Resolving deltas:  42% (6360/15024)   
03-Jan-2021 00:10:21 Resolving deltas:  43% (6464/15024)   
03-Jan-2021 00:10:21 Resolving deltas:  44% (6692/15024)   
03-Jan-2021 00:10:21 Resolving deltas:  45% (6782/15024)   
03-Jan-2021 00:10:21 Resolving deltas:  46% (6950/15024)   
03-Jan-2021 00:10:21 Resolving deltas:  48% (7252/15024)   
03-Jan-2021 00:10:21 Resolving deltas:  49% (7372/15024)   
03-Jan-2021 00:10:21 Resolving deltas:  50% (7519/15024)   
03-Jan-2021 00:10:21 Resolving deltas:  51% (7694/15024)   
03-Jan-2021 00:10:21 Resolving deltas:  52% (7847/15024)   
03-Jan-2021 00:10:21 Resolving deltas:  53% (7963/15024)   
03-Jan-2021 00:10:21 Resolving deltas:  54% (8114/15024)   
03-Jan-2021 00:10:21 Resolving deltas:  55% (8284/15024)   
03-Jan-2021 00:10:21 Resolving deltas:  56% (8438/15024)   
03-Jan-2021 00:10:21 Resolving deltas:  57% (8565/15024)   
03-Jan-2021 00:10:21 Resolving deltas:  58% (8728/15024)   
03-Jan-2021 00:10:21 Resolving deltas:  59% (8870/15024)   
03-Jan-2021 00:10:21 Resolving deltas:  60% (9028/15024)   
03-Jan-2021 00:10:21 Resolving deltas:  61% (9255/15024)   
03-Jan-2021 00:10:21 Resolving deltas:  62% (9316/15024)   
03-Jan-2021 00:10:21 Resolving deltas:  63% (9557/15024)   
03-Jan-2021 00:10:21 Resolving deltas:  64% (9640/15024)   
03-Jan-2021 00:10:21 Resolving deltas:  65% (9781/15024)   
03-Jan-2021 00:10:21 Resolving deltas:  66% (9926/15024)   
03-Jan-2021 00:10:21 Resolving deltas:  67% (10069/15024)   
03-Jan-2021 00:10:21 Resolving deltas:  68% (10217/15024)   
03-Jan-2021 00:10:21 Resolving deltas:  69% (10375/15024)   
03-Jan-2021 00:10:22 Resolving deltas:  70% (10523/15024)   
03-Jan-2021 00:10:22 Resolving deltas:  71% (10679/15024)   
03-Jan-2021 00:10:22 Resolving deltas:  72% (10872/15024)   
03-Jan-2021 00:10:22 Resolving deltas:  73% (10983/15024)   
03-Jan-2021 00:10:22 Resolving deltas:  74% (11137/15024)   
03-Jan-2021 00:10:22 Resolving deltas:  75% (11279/15024)   
03-Jan-2021 00:10:22 Resolving deltas:  76% (11442/15024)   
03-Jan-2021 00:10:22 Resolving deltas:  77% (11604/15024)   
03-Jan-2021 00:10:22 Resolving deltas:  78% (11727/15024)   
03-Jan-2021 00:10:22 Resolving deltas:  79% (11878/15024)   
03-Jan-2021 00:10:22 Resolving deltas:  80% (12022/15024)   
03-Jan-2021 00:10:22 Resolving deltas:  81% (12199/15024)   
03-Jan-2021 00:10:22 Resolving deltas:  82% (12407/15024)   
03-Jan-2021 00:10:22 Resolving deltas:  83% (12479/15024)   
03-Jan-2021 00:10:22 Resolving deltas:  84% (12624/15024)   
03-Jan-2021 00:10:22 Resolving deltas:  85% (12771/15024)   
03-Jan-2021 00:10:22 Resolving deltas:  86% (12947/15024)   
03-Jan-2021 00:10:22 Resolving deltas:  87% (13084/15024)   
03-Jan-2021 00:10:22 Resolving deltas:  88% (13260/15024)   
03-Jan-2021 00:10:22 Resolving deltas:  89% (13379/15024)   
03-Jan-2021 00:10:22 Resolving deltas:  90% (13534/15024)   
03-Jan-2021 00:10:22 Resolving deltas:  91% (13673/15024)   
03-Jan-2021 00:10:22 Resolving deltas:  92% (13829/15024)   
03-Jan-2021 00:10:22 Resolving deltas:  93% (13973/15024)   
03-Jan-2021 00:10:22 Resolving deltas:  94% (14133/15024)   
03-Jan-2021 00:10:22 Resolving deltas:  94% (14158/15024)   
03-Jan-2021 00:10:22 Resolving deltas:  95% (14293/15024)   
03-Jan-2021 00:10:22 Resolving deltas:  96% (14435/15024)   
03-Jan-2021 00:10:22 Resolving deltas:  97% (14574/15024)   
03-Jan-2021 00:10:22 Resolving deltas:  98% (14726/15024)   
03-Jan-2021 00:10:22 Resolving deltas:  99% (14890/15024)   
03-Jan-2021 00:10:22 Resolving deltas: 100% (15024/15024)   
03-Jan-2021 00:10:22 Resolving deltas: 100% (15024/15024), done.
03-Jan-2021 00:11:03 #13 99.68 ________ running 'vpython src/src/tools/python/deps-to-manifest.py src/DEPS src/default.xml' in '/opt/breakpad'
03-Jan-2021 00:11:10 #13 106.6 Running: gclient root
03-Jan-2021 00:11:10 #13 106.6 Running: gclient config --spec 'solutions = [
03-Jan-2021 00:11:10 #13 106.6   {
03-Jan-2021 00:11:10 #13 106.6     "url": "https://chromium.googlesource.com/breakpad/breakpad.git",
03-Jan-2021 00:11:10 #13 106.6     "managed": False,
03-Jan-2021 00:11:10 #13 106.6     "name": "src",
03-Jan-2021 00:11:10 #13 106.6     "custom_deps": {},
03-Jan-2021 00:11:10 #13 106.6   },
03-Jan-2021 00:11:10 #13 106.6 ]
03-Jan-2021 00:11:10 #13 106.6 '
03-Jan-2021 00:11:10 #13 106.6 Running: gclient sync
03-Jan-2021 00:11:10 #13 106.6 Running: git submodule foreach 'git config -f $toplevel/.git/config submodule.$name.ignore all'
03-Jan-2021 00:11:10 #13 106.6 Running: git config --add remote.origin.fetch '+refs/tags/*:refs/tags/*'
03-Jan-2021 00:11:10 #13 106.6 Running: git config diff.ignoreSubmodules all
03-Jan-2021 00:11:11 #13 107.3 checking build system type... armv7l-unknown-linux-gnueabihf
03-Jan-2021 00:11:11 #13 107.6 checking host system type... armv7l-unknown-linux-gnueabihf
03-Jan-2021 00:11:11 #13 107.6 checking for a BSD-compatible install... /usr/bin/install -c
03-Jan-2021 00:11:11 #13 107.6 checking whether build environment is sane... yes
03-Jan-2021 00:11:11 #13 107.7 checking for a thread-safe mkdir -p... /bin/mkdir -p
03-Jan-2021 00:11:11 #13 107.7 checking for gawk... no
03-Jan-2021 00:11:11 #13 107.7 checking for mawk... mawk
03-Jan-2021 00:11:11 #13 107.7 checking whether make sets $(MAKE)... yes
03-Jan-2021 00:11:11 #13 107.7 checking whether make supports nested variables... yes
03-Jan-2021 00:11:11 #13 107.8 checking whether UID '0' is supported by ustar format... yes
03-Jan-2021 00:11:11 #13 107.8 checking whether GID '0' is supported by ustar format... yes
03-Jan-2021 00:11:11 #13 107.8 checking how to create a ustar tar archive... gnutar
03-Jan-2021 00:11:11 #13 107.8 checking whether to enable maintainer-specific portions of Makefiles... no
03-Jan-2021 00:11:11 #13 107.8 checking for style of include used by make... GNU
03-Jan-2021 00:11:11 #13 107.9 checking for gcc... gcc
03-Jan-2021 00:11:12 #13 108.0 checking whether the C compiler works... yes
03-Jan-2021 00:11:12 #13 108.1 checking for C compiler default output file name... a.out
03-Jan-2021 00:11:12 #13 108.1 checking for suffix of executables...
03-Jan-2021 00:11:12 #13 108.3 checking whether we are cross compiling... no
03-Jan-2021 00:11:12 #13 108.6 checking for suffix of object files... o
03-Jan-2021 00:11:12 #13 108.6 checking whether we are using the GNU C compiler... yes
03-Jan-2021 00:11:12 #13 108.7 checking whether gcc accepts -g... yes
03-Jan-2021 00:11:12 #13 108.8 checking for gcc option to accept ISO C89... none needed
03-Jan-2021 00:11:12 #13 108.9 checking whether gcc understands -c and -o together... yes
03-Jan-2021 00:11:13 #13 109.1 checking dependency style of gcc... gcc3
03-Jan-2021 00:11:13 #13 109.2 checking for ar... ar
03-Jan-2021 00:11:13 #13 109.2 checking the archiver (ar) interface... ar
03-Jan-2021 00:11:13 #13 109.3 checking dependency style of gcc... gcc3
03-Jan-2021 00:11:13 #13 109.5 checking for gcc... (cached) gcc
03-Jan-2021 00:11:13 #13 109.6 checking whether we are using the GNU C compiler... (cached) yes
03-Jan-2021 00:11:13 #13 109.6 checking whether gcc accepts -g... (cached) yes
03-Jan-2021 00:11:13 #13 109.6 checking for gcc option to accept ISO C89... (cached) none needed
03-Jan-2021 00:11:13 #13 109.6 checking whether gcc understands -c and -o together... (cached) yes
03-Jan-2021 00:11:13 #13 109.6 checking dependency style of gcc... (cached) gcc3
03-Jan-2021 00:11:13 #13 109.6 checking how to run the C preprocessor... gcc -E
03-Jan-2021 00:11:13 #13 109.8 checking for g++... g++
03-Jan-2021 00:11:14 #13 109.9 checking whether we are using the GNU C++ compiler... yes
03-Jan-2021 00:11:14 #13 110.0 checking whether g++ accepts -g... yes
03-Jan-2021 00:11:14 #13 110.1 checking dependency style of g++... gcc3
03-Jan-2021 00:11:14 #13 110.2 checking for ranlib... ranlib
03-Jan-2021 00:11:14 #13 110.2 checking for grep that handles long lines and -e... /bin/grep
03-Jan-2021 00:11:14 #13 110.3 checking for egrep... /bin/grep -E
03-Jan-2021 00:11:14 #13 110.3 checking for ANSI C header files... yes
03-Jan-2021 00:11:14 #13 110.7 checking for special C compiler options needed for large files... no
03-Jan-2021 00:11:14 #13 110.7 checking for _FILE_OFFSET_BITS value needed for large files... 64
03-Jan-2021 00:11:15 #13 110.9 checking for the pthreads library -lpthreads... no
03-Jan-2021 00:11:15 #13 111.1 checking whether pthreads work without any flags... no
03-Jan-2021 00:11:15 #13 111.3 checking whether pthreads work with -Kthread... no
03-Jan-2021 00:11:15 #13 111.4 checking whether pthreads work with -kthread... no
03-Jan-2021 00:11:15 #13 111.4 checking for the pthreads library -llthread... no
03-Jan-2021 00:11:15 #13 111.6 checking whether pthreads work with -pthread... yes
03-Jan-2021 00:11:15 #13 111.8 checking for joinable pthread attribute... PTHREAD_CREATE_JOINABLE
03-Jan-2021 00:11:15 #13 112.0 checking if more special flags are required for pthreads... no
03-Jan-2021 00:11:15 #13 112.0 checking for sys/types.h... yes
03-Jan-2021 00:11:16 #13 112.1 checking for sys/stat.h... yes
03-Jan-2021 00:11:16 #13 112.2 checking for stdlib.h... yes
03-Jan-2021 00:11:16 #13 112.4 checking for string.h... yes
03-Jan-2021 00:11:16 #13 112.5 checking for memory.h... yes
03-Jan-2021 00:11:16 #13 112.6 checking for strings.h... yes
03-Jan-2021 00:11:16 #13 112.8 checking for inttypes.h... yes
03-Jan-2021 00:11:16 #13 113.0 checking for stdint.h... yes
03-Jan-2021 00:11:17 #13 113.1 checking for unistd.h... yes
03-Jan-2021 00:11:17 #13 113.2 checking a.out.h usability... yes
03-Jan-2021 00:11:17 #13 113.4 checking a.out.h presence... yes
03-Jan-2021 00:11:17 #13 113.4 checking for a.out.h... yes
03-Jan-2021 00:11:17 #13 113.4 checking sys/random.h usability... yes
03-Jan-2021 00:11:17 #13 113.6 checking sys/random.h presence... yes
03-Jan-2021 00:11:17 #13 113.6 checking for sys/random.h... yes
03-Jan-2021 00:11:17 #13 113.7 checking for arc4random... no
03-Jan-2021 00:11:17 #13 113.9 checking for getcontext... yes
03-Jan-2021 00:11:18 #13 114.1 checking for getrandom... yes
03-Jan-2021 00:11:18 #13 114.3 checking whether g++ supports C++11 features by default... yes
03-Jan-2021 00:11:18 #13 114.4 checking whether C++ compiler accepts -Werror=unknown-warning-option... no
03-Jan-2021 00:11:18 #13 114.5 checking whether C++ compiler accepts -Wmissing-braces... yes
03-Jan-2021 00:11:18 #13 114.6 checking whether C++ compiler accepts -Wnon-virtual-dtor... yes
03-Jan-2021 00:11:18 #13 114.7 checking whether C++ compiler accepts -Woverloaded-virtual... yes
03-Jan-2021 00:11:18 #13 114.8 checking whether C++ compiler accepts -Wreorder... yes
03-Jan-2021 00:11:19 #13 114.9 checking whether C++ compiler accepts -Wsign-compare... yes
03-Jan-2021 00:11:19 #13 115.0 checking whether C++ compiler accepts -Wunused-local-typedefs... yes
03-Jan-2021 00:11:19 #13 115.1 checking whether C++ compiler accepts -Wunused-variable... yes
03-Jan-2021 00:11:19 #13 115.2 checking whether C++ compiler accepts -Wvla... yes
03-Jan-2021 00:11:19 #13 115.3 checking for O_CLOEXEC defined in fcntl.h... yes
03-Jan-2021 00:11:19 #13 115.5 checking that generated files are newer than configure... done
03-Jan-2021 00:11:19 #13 115.5 configure: creating ./config.status
03-Jan-2021 00:11:19 #13 115.8 config.status: creating breakpad.pc
03-Jan-2021 00:11:19 #13 115.8 config.status: creating breakpad-client.pc
03-Jan-2021 00:11:19 #13 115.9 config.status: creating Makefile
03-Jan-2021 00:11:19 #13 116.0 config.status: creating src/config.h
03-Jan-2021 00:11:19 #13 116.0 config.status: executing depfiles commands
03-Jan-2021 00:11:22 #13 118.2 depbase=`echo src/client/linux/crash_generation/crash_generation_client.o | sed 's|[^/]*$|.deps/&|;s|\.o$||'`;\
03-Jan-2021 00:11:22 #13 118.2 g++ -DHAVE_CONFIG_H -I. -I./src  -I./src   -Wmissing-braces -Wnon-virtual-dtor -Woverloaded-virtual -Wreorder -Wsign-compare -Wunused-local-typedefs -Wunused-variable -Wvla -Werror -fPIC -g -O2 -MT src/client/linux/crash_generation/crash_generation_client.o -MD -MP -MF $depbase.Tpo -c -o src/client/linux/crash_generation/crash_generation_client.o src/client/linux/crash_generation/crash_generation_client.cc &&\
03-Jan-2021 00:11:22 #13 118.2 mv -f $depbase.Tpo $depbase.Po
03-Jan-2021 00:11:22 #13 118.2 depbase=`echo src/client/linux/crash_generation/crash_generation_server.o | sed 's|[^/]*$|.deps/&|;s|\.o$||'`;\
03-Jan-2021 00:11:22 #13 118.2 g++ -DHAVE_CONFIG_H -I. -I./src  -I./src   -Wmissing-braces -Wnon-virtual-dtor -Woverloaded-virtual -Wreorder -Wsign-compare -Wunused-local-typedefs -Wunused-variable -Wvla -Werror -fPIC -g -O2 -MT src/client/linux/crash_generation/crash_generation_server.o -MD -MP -MF $depbase.Tpo -c -o src/client/linux/crash_generation/crash_generation_server.o src/client/linux/crash_generation/crash_generation_server.cc &&\
03-Jan-2021 00:11:22 #13 118.2 mv -f $depbase.Tpo $depbase.Po
03-Jan-2021 00:11:22 #13 118.2 depbase=`echo src/client/linux/dump_writer_common/thread_info.o | sed 's|[^/]*$|.deps/&|;s|\.o$||'`;\
03-Jan-2021 00:11:22 #13 118.2 g++ -DHAVE_CONFIG_H -I. -I./src  -I./src   -Wmissing-braces -Wnon-virtual-dtor -Woverloaded-virtual -Wreorder -Wsign-compare -Wunused-local-typedefs -Wunused-variable -Wvla -Werror -fPIC -g -O2 -MT src/client/linux/dump_writer_common/thread_info.o -MD -MP -MF $depbase.Tpo -c -o src/client/linux/dump_writer_common/thread_info.o src/client/linux/dump_writer_common/thread_info.cc &&\
03-Jan-2021 00:11:22 #13 118.2 mv -f $depbase.Tpo $depbase.Po
03-Jan-2021 00:11:22 #13 118.2 depbase=`echo src/client/linux/dump_writer_common/ucontext_reader.o | sed 's|[^/]*$|.deps/&|;s|\.o$||'`;\
03-Jan-2021 00:11:22 #13 118.2 g++ -DHAVE_CONFIG_H -I. -I./src  -I./src   -Wmissing-braces -Wnon-virtual-dtor -Woverloaded-virtual -Wreorder -Wsign-compare -Wunused-local-typedefs -Wunused-variable -Wvla -Werror -fPIC -g -O2 -MT src/client/linux/dump_writer_common/ucontext_reader.o -MD -MP -MF $depbase.Tpo -c -o src/client/linux/dump_writer_common/ucontext_reader.o src/client/linux/dump_writer_common/ucontext_reader.cc &&\
03-Jan-2021 00:11:22 #13 118.2 mv -f $depbase.Tpo $depbase.Po
03-Jan-2021 00:11:22 #13 118.2 depbase=`echo src/client/linux/handler/exception_handler.o | sed 's|[^/]*$|.deps/&|;s|\.o$||'`;\
03-Jan-2021 00:11:22 #13 118.2 g++ -DHAVE_CONFIG_H -I. -I./src  -I./src   -Wmissing-braces -Wnon-virtual-dtor -Woverloaded-virtual -Wreorder -Wsign-compare -Wunused-local-typedefs -Wunused-variable -Wvla -Werror -fPIC -g -O2 -MT src/client/linux/handler/exception_handler.o -MD -MP -MF $depbase.Tpo -c -o src/client/linux/handler/exception_handler.o src/client/linux/handler/exception_handler.cc &&\
03-Jan-2021 00:11:22 #13 118.2 mv -f $depbase.Tpo $depbase.Po
03-Jan-2021 00:11:22 #13 118.2 depbase=`echo src/client/linux/handler/minidump_descriptor.o | sed 's|[^/]*$|.deps/&|;s|\.o$||'`;\
03-Jan-2021 00:11:22 #13 118.2 g++ -DHAVE_CONFIG_H -I. -I./src  -I./src   -Wmissing-braces -Wnon-virtual-dtor -Woverloaded-virtual -Wreorder -Wsign-compare -Wunused-local-typedefs -Wunused-variable -Wvla -Werror -fPIC -g -O2 -MT src/client/linux/handler/minidump_descriptor.o -MD -MP -MF $depbase.Tpo -c -o src/client/linux/handler/minidump_descriptor.o src/client/linux/handler/minidump_descriptor.cc &&\
03-Jan-2021 00:11:22 #13 118.2 mv -f $depbase.Tpo $depbase.Po
03-Jan-2021 00:11:22 #13 118.2 depbase=`echo src/client/linux/log/log.o | sed 's|[^/]*$|.deps/&|;s|\.o$||'`;\
03-Jan-2021 00:11:22 #13 118.2 g++ -DHAVE_CONFIG_H -I. -I./src  -I./src   -Wmissing-braces -Wnon-virtual-dtor -Woverloaded-virtual -Wreorder -Wsign-compare -Wunused-local-typedefs -Wunused-variable -Wvla -Werror -fPIC -g -O2 -MT src/client/linux/log/log.o -MD -MP -MF $depbase.Tpo -c -o src/client/linux/log/log.o src/client/linux/log/log.cc &&\
03-Jan-2021 00:11:22 #13 118.2 mv -f $depbase.Tpo $depbase.Po
03-Jan-2021 00:11:22 #13 118.2 depbase=`echo src/client/linux/microdump_writer/microdump_writer.o | sed 's|[^/]*$|.deps/&|;s|\.o$||'`;\
03-Jan-2021 00:11:22 #13 118.2 g++ -DHAVE_CONFIG_H -I. -I./src  -I./src   -Wmissing-braces -Wnon-virtual-dtor -Woverloaded-virtual -Wreorder -Wsign-compare -Wunused-local-typedefs -Wunused-variable -Wvla -Werror -fPIC -g -O2 -MT src/client/linux/microdump_writer/microdump_writer.o -MD -MP -MF $depbase.Tpo -c -o src/client/linux/microdump_writer/microdump_writer.o src/client/linux/microdump_writer/microdump_writer.cc &&\
03-Jan-2021 00:11:22 #13 118.2 mv -f $depbase.Tpo $depbase.Po
03-Jan-2021 00:11:22 #13 118.2 depbase=`echo src/client/linux/minidump_writer/linux_core_dumper.o | sed 's|[^/]*$|.deps/&|;s|\.o$||'`;\
03-Jan-2021 00:11:22 #13 118.2 g++ -DHAVE_CONFIG_H -I. -I./src  -I./src   -Wmissing-braces -Wnon-virtual-dtor -Woverloaded-virtual -Wreorder -Wsign-compare -Wunused-local-typedefs -Wunused-variable -Wvla -Werror -fPIC -g -O2 -MT src/client/linux/minidump_writer/linux_core_dumper.o -MD -MP -MF $depbase.Tpo -c -o src/client/linux/minidump_writer/linux_core_dumper.o src/client/linux/minidump_writer/linux_core_dumper.cc &&\
03-Jan-2021 00:11:22 #13 118.2 mv -f $depbase.Tpo $depbase.Po
03-Jan-2021 00:11:22 #13 118.2 depbase=`echo src/client/linux/minidump_writer/linux_dumper.o | sed 's|[^/]*$|.deps/&|;s|\.o$||'`;\
03-Jan-2021 00:11:22 #13 118.2 g++ -DHAVE_CONFIG_H -I. -I./src  -I./src   -Wmissing-braces -Wnon-virtual-dtor -Woverloaded-virtual -Wreorder -Wsign-compare -Wunused-local-typedefs -Wunused-variable -Wvla -Werror -fPIC -g -O2 -MT src/client/linux/minidump_writer/linux_dumper.o -MD -MP -MF $depbase.Tpo -c -o src/client/linux/minidump_writer/linux_dumper.o src/client/linux/minidump_writer/linux_dumper.cc &&\
03-Jan-2021 00:11:22 #13 118.2 mv -f $depbase.Tpo $depbase.Po
03-Jan-2021 00:11:22 #13 118.2 depbase=`echo src/client/linux/minidump_writer/linux_ptrace_dumper.o | sed 's|[^/]*$|.deps/&|;s|\.o$||'`;\
03-Jan-2021 00:11:22 #13 118.2 g++ -DHAVE_CONFIG_H -I. -I./src  -I./src   -Wmissing-braces -Wnon-virtual-dtor -Woverloaded-virtual -Wreorder -Wsign-compare -Wunused-local-typedefs -Wunused-variable -Wvla -Werror -fPIC -g -O2 -MT src/client/linux/minidump_writer/linux_ptrace_dumper.o -MD -MP -MF $depbase.Tpo -c -o src/client/linux/minidump_writer/linux_ptrace_dumper.o src/client/linux/minidump_writer/linux_ptrace_dumper.cc &&\
03-Jan-2021 00:11:22 #13 118.2 mv -f $depbase.Tpo $depbase.Po
03-Jan-2021 00:11:22 #13 118.2 depbase=`echo src/client/linux/minidump_writer/minidump_writer.o | sed 's|[^/]*$|.deps/&|;s|\.o$||'`;\
03-Jan-2021 00:11:22 #13 118.2 g++ -DHAVE_CONFIG_H -I. -I./src  -I./src   -Wmissing-braces -Wnon-virtual-dtor -Woverloaded-virtual -Wreorder -Wsign-compare -Wunused-local-typedefs -Wunused-variable -Wvla -Werror -fPIC -g -O2 -MT src/client/linux/minidump_writer/minidump_writer.o -MD -MP -MF $depbase.Tpo -c -o src/client/linux/minidump_writer/minidump_writer.o src/client/linux/minidump_writer/minidump_writer.cc &&\
03-Jan-2021 00:11:22 #13 118.2 mv -f $depbase.Tpo $depbase.Po
03-Jan-2021 00:11:22 #13 118.9 depbase=`echo src/client/minidump_file_writer.o | sed 's|[^/]*$|.deps/&|;s|\.o$||'`;\
03-Jan-2021 00:11:22 #13 118.9 g++ -DHAVE_CONFIG_H -I. -I./src  -I./src   -Wmissing-braces -Wnon-virtual-dtor -Woverloaded-virtual -Wreorder -Wsign-compare -Wunused-local-typedefs -Wunused-variable -Wvla -Werror -fPIC -g -O2 -MT src/client/minidump_file_writer.o -MD -MP -MF $depbase.Tpo -c -o src/client/minidump_file_writer.o src/client/minidump_file_writer.cc &&\
03-Jan-2021 00:11:22 #13 118.9 mv -f $depbase.Tpo $depbase.Po
03-Jan-2021 00:11:23 #13 119.2 depbase=`echo src/common/convert_UTF.o | sed 's|[^/]*$|.deps/&|;s|\.o$||'`;\
03-Jan-2021 00:11:23 #13 119.2 g++ -DHAVE_CONFIG_H -I. -I./src  -I./src   -Wmissing-braces -Wnon-virtual-dtor -Woverloaded-virtual -Wreorder -Wsign-compare -Wunused-local-typedefs -Wunused-variable -Wvla -Werror -fPIC -g -O2 -MT src/common/convert_UTF.o -MD -MP -MF $depbase.Tpo -c -o src/common/convert_UTF.o src/common/convert_UTF.cc &&\
03-Jan-2021 00:11:23 #13 119.2 mv -f $depbase.Tpo $depbase.Po
03-Jan-2021 00:11:23 #13 119.6 depbase=`echo src/common/md5.o | sed 's|[^/]*$|.deps/&|;s|\.o$||'`;\
03-Jan-2021 00:11:23 #13 119.6 g++ -DHAVE_CONFIG_H -I. -I./src  -I./src   -Wmissing-braces -Wnon-virtual-dtor -Woverloaded-virtual -Wreorder -Wsign-compare -Wunused-local-typedefs -Wunused-variable -Wvla -Werror -fPIC -g -O2 -MT src/common/md5.o -MD -MP -MF $depbase.Tpo -c -o src/common/md5.o src/common/md5.cc &&\
03-Jan-2021 00:11:23 #13 119.6 mv -f $depbase.Tpo $depbase.Po
03-Jan-2021 00:11:23 #13 119.8 depbase=`echo src/common/string_conversion.o | sed 's|[^/]*$|.deps/&|;s|\.o$||'`;\
03-Jan-2021 00:11:23 #13 119.8 g++ -DHAVE_CONFIG_H -I. -I./src  -I./src   -Wmissing-braces -Wnon-virtual-dtor -Woverloaded-virtual -Wreorder -Wsign-compare -Wunused-local-typedefs -Wunused-variable -Wvla -Werror -fPIC -g -O2 -MT src/common/string_conversion.o -MD -MP -MF $depbase.Tpo -c -o src/common/string_conversion.o src/common/string_conversion.cc &&\
03-Jan-2021 00:11:23 #13 119.8 mv -f $depbase.Tpo $depbase.Po
03-Jan-2021 00:11:23 #13 119.9 depbase=`echo src/common/linux/elf_core_dump.o | sed 's|[^/]*$|.deps/&|;s|\.o$||'`;\
03-Jan-2021 00:11:23 #13 119.9 g++ -DHAVE_CONFIG_H -I. -I./src  -I./src   -Wmissing-braces -Wnon-virtual-dtor -Woverloaded-virtual -Wreorder -Wsign-compare -Wunused-local-typedefs -Wunused-variable -Wvla -Werror -fPIC -g -O2 -MT src/common/linux/elf_core_dump.o -MD -MP -MF $depbase.Tpo -c -o src/common/linux/elf_core_dump.o src/common/linux/elf_core_dump.cc &&\
03-Jan-2021 00:11:23 #13 119.9 mv -f $depbase.Tpo $depbase.Po
03-Jan-2021 00:11:24 #13 120.2 depbase=`echo src/common/linux/elfutils.o | sed 's|[^/]*$|.deps/&|;s|\.o$||'`;\
03-Jan-2021 00:11:24 #13 120.2 g++ -DHAVE_CONFIG_H -I. -I./src  -I./src   -Wmissing-braces -Wnon-virtual-dtor -Woverloaded-virtual -Wreorder -Wsign-compare -Wunused-local-typedefs -Wunused-variable -Wvla -Werror -fPIC -g -O2 -MT src/common/linux/elfutils.o -MD -MP -MF $depbase.Tpo -c -o src/common/linux/elfutils.o src/common/linux/elfutils.cc &&\
03-Jan-2021 00:11:24 #13 120.2 mv -f $depbase.Tpo $depbase.Po
03-Jan-2021 00:11:24 #13 120.2 depbase=`echo src/common/linux/file_id.o | sed 's|[^/]*$|.deps/&|;s|\.o$||'`;\
03-Jan-2021 00:11:24 #13 120.2 g++ -DHAVE_CONFIG_H -I. -I./src  -I./src   -Wmissing-braces -Wnon-virtual-dtor -Woverloaded-virtual -Wreorder -Wsign-compare -Wunused-local-typedefs -Wunused-variable -Wvla -Werror -fPIC -g -O2 -MT src/common/linux/file_id.o -MD -MP -MF $depbase.Tpo -c -o src/common/linux/file_id.o src/common/linux/file_id.cc &&\
03-Jan-2021 00:11:24 #13 120.2 mv -f $depbase.Tpo $depbase.Po
03-Jan-2021 00:11:24 #13 120.3 depbase=`echo src/common/linux/guid_creator.o | sed 's|[^/]*$|.deps/&|;s|\.o$||'`;\
03-Jan-2021 00:11:24 #13 120.3 g++ -DHAVE_CONFIG_H -I. -I./src  -I./src   -Wmissing-braces -Wnon-virtual-dtor -Woverloaded-virtual -Wreorder -Wsign-compare -Wunused-local-typedefs -Wunused-variable -Wvla -Werror -fPIC -g -O2 -MT src/common/linux/guid_creator.o -MD -MP -MF $depbase.Tpo -c -o src/common/linux/guid_creator.o src/common/linux/guid_creator.cc &&\
03-Jan-2021 00:11:24 #13 120.3 mv -f $depbase.Tpo $depbase.Po
03-Jan-2021 00:11:24 #13 120.4 depbase=`echo src/common/linux/linux_libc_support.o | sed 's|[^/]*$|.deps/&|;s|\.o$||'`;\
03-Jan-2021 00:11:24 #13 120.4 g++ -DHAVE_CONFIG_H -I. -I./src  -I./src   -Wmissing-braces -Wnon-virtual-dtor -Woverloaded-virtual -Wreorder -Wsign-compare -Wunused-local-typedefs -Wunused-variable -Wvla -Werror -fPIC -g -O2 -MT src/common/linux/linux_libc_support.o -MD -MP -MF $depbase.Tpo -c -o src/common/linux/linux_libc_support.o src/common/linux/linux_libc_support.cc &&\
03-Jan-2021 00:11:24 #13 120.4 mv -f $depbase.Tpo $depbase.Po
03-Jan-2021 00:11:24 #13 120.5 depbase=`echo src/common/linux/memory_mapped_file.o | sed 's|[^/]*$|.deps/&|;s|\.o$||'`;\
03-Jan-2021 00:11:24 #13 120.5 g++ -DHAVE_CONFIG_H -I. -I./src  -I./src   -Wmissing-braces -Wnon-virtual-dtor -Woverloaded-virtual -Wreorder -Wsign-compare -Wunused-local-typedefs -Wunused-variable -Wvla -Werror -fPIC -g -O2 -MT src/common/linux/memory_mapped_file.o -MD -MP -MF $depbase.Tpo -c -o src/common/linux/memory_mapped_file.o src/common/linux/memory_mapped_file.cc &&\
03-Jan-2021 00:11:24 #13 120.5 mv -f $depbase.Tpo $depbase.Po
03-Jan-2021 00:11:24 #13 120.6 depbase=`echo src/common/linux/safe_readlink.o | sed 's|[^/]*$|.deps/&|;s|\.o$||'`;\
03-Jan-2021 00:11:24 #13 120.6 g++ -DHAVE_CONFIG_H -I. -I./src  -I./src   -Wmissing-braces -Wnon-virtual-dtor -Woverloaded-virtual -Wreorder -Wsign-compare -Wunused-local-typedefs -Wunused-variable -Wvla -Werror -fPIC -g -O2 -MT src/common/linux/safe_readlink.o -MD -MP -MF $depbase.Tpo -c -o src/common/linux/safe_readlink.o src/common/linux/safe_readlink.cc &&\
03-Jan-2021 00:11:24 #13 120.6 mv -f $depbase.Tpo $depbase.Po
03-Jan-2021 00:11:29 #13 125.5 In file included from /usr/include/c++/8/vector:69,
03-Jan-2021 00:11:29 #13 125.5                  from ./src/client/linux/minidump_writer/linux_dumper.h:51,
03-Jan-2021 00:11:29 #13 125.5                  from ./src/client/linux/minidump_writer/minidump_writer.h:42,
03-Jan-2021 00:11:29 #13 125.5                  from src/client/linux/minidump_writer/minidump_writer.cc:47:
03-Jan-2021 00:11:29 #13 125.5 /usr/include/c++/8/bits/vector.tcc: In member function 'void std::vector<_Tp, _Alloc>::_M_realloc_insert(std::vector<_Tp, _Alloc>::iterator, _Args&& ...) [with _Args = {const MDMemoryDescriptor&}; _Tp = MDMemoryDescriptor; _Alloc = google_breakpad::PageStdAllocator<MDMemoryDescriptor>]':
03-Jan-2021 00:11:29 #13 125.5 /usr/include/c++/8/bits/vector.tcc:413:7: note: parameter passing for argument of type 'std::vector<MDMemoryDescriptor, google_breakpad::PageStdAllocator<MDMemoryDescriptor> >::iterator' {aka '__gnu_cxx::__normal_iterator<MDMemoryDescriptor*, std::vector<MDMemoryDescriptor, google_breakpad::PageStdAllocator<MDMemoryDescriptor> > >'} changed in GCC 7.1
03-Jan-2021 00:11:29 #13 125.5        vector<_Tp, _Alloc>::
03-Jan-2021 00:11:29 #13 125.5        ^~~~~~~~~~~~~~~~~~~
03-Jan-2021 00:11:29 #13 125.5 In file included from /usr/include/c++/8/vector:64,
03-Jan-2021 00:11:29 #13 125.5                  from ./src/client/linux/minidump_writer/linux_dumper.h:51,
03-Jan-2021 00:11:29 #13 125.5                  from ./src/client/linux/minidump_writer/minidump_writer.h:42,
03-Jan-2021 00:11:29 #13 125.5                  from src/client/linux/minidump_writer/minidump_writer.cc:47:
03-Jan-2021 00:11:29 #13 125.5 /usr/include/c++/8/bits/stl_vector.h: In member function 'bool {anonymous}::MinidumpWriter::WriteThreadListStream(MDRawDirectory*)':
03-Jan-2021 00:11:29 #13 125.5 /usr/include/c++/8/bits/stl_vector.h:1085:4: note: parameter passing for argument of type '__gnu_cxx::__normal_iterator<MDMemoryDescriptor*, std::vector<MDMemoryDescriptor, google_breakpad::PageStdAllocator<MDMemoryDescriptor> > >' changed in GCC 7.1
03-Jan-2021 00:11:29 #13 125.5     _M_realloc_insert(end(), __x);
03-Jan-2021 00:11:29 #13 125.5     ^~~~~~~~~~~~~~~~~
03-Jan-2021 00:11:29 #13 125.5 /usr/include/c++/8/bits/stl_vector.h:1085:4: note: parameter passing for argument of type '__gnu_cxx::__normal_iterator<MDMemoryDescriptor*, std::vector<MDMemoryDescriptor, google_breakpad::PageStdAllocator<MDMemoryDescriptor> > >' changed in GCC 7.1
03-Jan-2021 00:11:29 #13 125.5     _M_realloc_insert(end(), __x);
03-Jan-2021 00:11:29 #13 125.5     ^~~~~~~~~~~~~~~~~
03-Jan-2021 00:11:29 #13 125.5 /usr/include/c++/8/bits/stl_vector.h:1085:4: note: parameter passing for argument of type '__gnu_cxx::__normal_iterator<MDMemoryDescriptor*, std::vector<MDMemoryDescriptor, google_breakpad::PageStdAllocator<MDMemoryDescriptor> > >' changed in GCC 7.1
03-Jan-2021 00:11:29 #13 125.5     _M_realloc_insert(end(), __x);
03-Jan-2021 00:11:29 #13 125.5     ^~~~~~~~~~~~~~~~~
03-Jan-2021 00:11:29 #13 125.5 /usr/include/c++/8/bits/stl_vector.h: In member function 'bool {anonymous}::MinidumpWriter::Dump()':
03-Jan-2021 00:11:29 #13 125.5 /usr/include/c++/8/bits/stl_vector.h:1085:4: note: parameter passing for argument of type '__gnu_cxx::__normal_iterator<MDMemoryDescriptor*, std::vector<MDMemoryDescriptor, google_breakpad::PageStdAllocator<MDMemoryDescriptor> > >' changed in GCC 7.1
03-Jan-2021 00:11:29 #13 125.5     _M_realloc_insert(end(), __x);
03-Jan-2021 00:11:29 #13 125.5     ^~~~~~~~~~~~~~~~~
03-Jan-2021 00:11:29 #13 125.5 rm -f src/client/linux/libbreakpad_client.a
03-Jan-2021 00:11:29 #13 125.6 ar cru src/client/linux/libbreakpad_client.a src/client/linux/crash_generation/crash_generation_client.o src/client/linux/crash_generation/crash_generation_server.o src/client/linux/dump_writer_common/thread_info.o src/client/linux/dump_writer_common/ucontext_reader.o src/client/linux/handler/exception_handler.o src/client/linux/handler/minidump_descriptor.o src/client/linux/log/log.o src/client/linux/microdump_writer/microdump_writer.o src/client/linux/minidump_writer/linux_core_dumper.o src/client/linux/minidump_writer/linux_dumper.o src/client/linux/minidump_writer/linux_ptrace_dumper.o src/client/linux/minidump_writer/minidump_writer.o src/client/minidump_file_writer.o src/common/convert_UTF.o src/common/md5.o src/common/string_conversion.o src/common/linux/elf_core_dump.o src/common/linux/elfutils.o src/common/linux/file_id.o src/common/linux/guid_creator.o src/common/linux/linux_libc_support.o src/common/linux/memory_mapped_file.o src/common/linux/safe_readlink.o 
03-Jan-2021 00:11:29 #13 125.6 ar: `u' modifier ignored since `D' is the default (see `U')
03-Jan-2021 00:11:29 #13 125.6 ranlib src/client/linux/libbreakpad_client.a
03-Jan-2021 00:11:29 #13 126.1 make[1]: Entering directory '/opt/breakpad/src'
03-Jan-2021 00:11:30 #13 126.1  /bin/mkdir -p '/usr/local/bin'
03-Jan-2021 00:11:30 #13 126.2  /bin/mkdir -p '/usr/local/lib'
03-Jan-2021 00:11:30 #13 126.2  /usr/bin/install -c -m 644  src/client/linux/libbreakpad_client.a '/usr/local/lib'
03-Jan-2021 00:11:30 #13 126.2  ( cd '/usr/local/lib' && ranlib libbreakpad_client.a )
03-Jan-2021 00:11:30 #13 126.3  /bin/mkdir -p '/usr/local/share/doc/breakpad-0.1'
03-Jan-2021 00:11:30 #13 126.3  /usr/bin/install -c -m 644 AUTHORS ChangeLog INSTALL LICENSE NEWS README.md '/usr/local/share/doc/breakpad-0.1'
03-Jan-2021 00:11:30 #13 126.3  /bin/mkdir -p '/usr/local/include/breakpad/common'
03-Jan-2021 00:11:30 #13 126.3  /usr/bin/install -c -m 644 ./src/common/basictypes.h ./src/common/byte_cursor.h ./src/common/convert_UTF.h ./src/common/dwarf_cfi_to_module.h ./src/common/dwarf_cu_to_module.h ./src/common/dwarf_line_to_module.h ./src/common/dwarf_range_list_handler.h ./src/common/language.h ./src/common/long_string_dictionary.h ./src/common/macros.h ./src/common/md5.h ./src/common/memory_allocator.h ./src/common/memory_range.h ./src/common/minidump_type_helper.h ./src/common/module.h ./src/common/path_helper.h ./src/common/scoped_ptr.h ./src/common/simple_string_dictionary.h ./src/common/stabs_reader.h ./src/common/stabs_to_module.h ./src/common/stdio_wrapper.h ./src/common/string_conversion.h ./src/common/symbol_data.h ./src/common/test_assembler.h ./src/common/unordered.h ./src/common/using_std_string.h '/usr/local/include/breakpad/common'
03-Jan-2021 00:11:30 #13 126.3  /bin/mkdir -p '/usr/local/include/breakpad/common/linux'
03-Jan-2021 00:11:30 #13 126.3  /usr/bin/install -c -m 644 ./src/common/linux/breakpad_getcontext.h ./src/common/linux/crc32.h ./src/common/linux/dump_symbols.h ./src/common/linux/eintr_wrapper.h ./src/common/linux/elf_core_dump.h ./src/common/linux/elf_gnu_compat.h ./src/common/linux/elf_symbols_to_module.h ./src/common/linux/elfutils-inl.h ./src/common/linux/elfutils.h ./src/common/linux/file_id.h ./src/common/linux/google_crashdump_uploader.h ./src/common/linux/guid_creator.h ./src/common/linux/http_upload.h ./src/common/linux/ignore_ret.h ./src/common/linux/libcurl_wrapper.h ./src/common/linux/linux_libc_support.h ./src/common/linux/memory_mapped_file.h ./src/common/linux/safe_readlink.h ./src/common/linux/symbol_collector_client.h ./src/common/linux/symbol_upload.h ./src/common/linux/synth_elf.h ./src/common/linux/ucontext_constants.h '/usr/local/include/breakpad/common/linux'
03-Jan-2021 00:11:30 #13 126.3  /bin/mkdir -p '/usr/local/include/breakpad/client/linux/crash_generation'
03-Jan-2021 00:11:30 #13 126.4  /usr/bin/install -c -m 644 ./src/client/linux/crash_generation/client_info.h ./src/client/linux/crash_generation/crash_generation_client.h ./src/client/linux/crash_generation/crash_generation_server.h '/usr/local/include/breakpad/client/linux/crash_generation'
03-Jan-2021 00:11:30 #13 126.4  /bin/mkdir -p '/usr/local/include/breakpad/client/linux/dump_writer_common'
03-Jan-2021 00:11:30 #13 126.4  /usr/bin/install -c -m 644 ./src/client/linux/dump_writer_common/mapping_info.h ./src/client/linux/dump_writer_common/raw_context_cpu.h ./src/client/linux/dump_writer_common/thread_info.h ./src/client/linux/dump_writer_common/ucontext_reader.h '/usr/local/include/breakpad/client/linux/dump_writer_common'
03-Jan-2021 00:11:30 #13 126.4  /bin/mkdir -p '/usr/local/include/breakpad/client/linux/handler'
03-Jan-2021 00:11:30 #13 126.4  /usr/bin/install -c -m 644 ./src/client/linux/handler/exception_handler.h ./src/client/linux/handler/microdump_extra_info.h ./src/client/linux/handler/minidump_descriptor.h '/usr/local/include/breakpad/client/linux/handler'
03-Jan-2021 00:11:30 #13 126.4  /bin/mkdir -p '/usr/local/include/breakpad/client/linux/minidump_writer'
03-Jan-2021 00:11:30 #13 126.4  /usr/bin/install -c -m 644 ./src/client/linux/minidump_writer/cpu_set.h ./src/client/linux/minidump_writer/directory_reader.h ./src/client/linux/minidump_writer/line_reader.h ./src/client/linux/minidump_writer/linux_core_dumper.h ./src/client/linux/minidump_writer/linux_dumper.h ./src/client/linux/minidump_writer/linux_ptrace_dumper.h ./src/client/linux/minidump_writer/minidump_writer.h ./src/client/linux/minidump_writer/minidump_writer_unittest_utils.h ./src/client/linux/minidump_writer/proc_cpuinfo_reader.h '/usr/local/include/breakpad/client/linux/minidump_writer'
03-Jan-2021 00:11:30 #13 126.5  /bin/mkdir -p '/usr/local/include/breakpad/google_breakpad/common'
03-Jan-2021 00:11:30 #13 126.5  /usr/bin/install -c -m 644 ./src/google_breakpad/common/breakpad_types.h ./src/google_breakpad/common/minidump_cpu_amd64.h ./src/google_breakpad/common/minidump_cpu_arm.h ./src/google_breakpad/common/minidump_cpu_arm64.h ./src/google_breakpad/common/minidump_cpu_mips.h ./src/google_breakpad/common/minidump_cpu_ppc.h ./src/google_breakpad/common/minidump_cpu_ppc64.h ./src/google_breakpad/common/minidump_cpu_sparc.h ./src/google_breakpad/common/minidump_cpu_x86.h ./src/google_breakpad/common/minidump_exception_fuchsia.h ./src/google_breakpad/common/minidump_exception_linux.h ./src/google_breakpad/common/minidump_exception_mac.h ./src/google_breakpad/common/minidump_exception_ps3.h ./src/google_breakpad/common/minidump_exception_solaris.h ./src/google_breakpad/common/minidump_exception_win32.h ./src/google_breakpad/common/minidump_format.h ./src/google_breakpad/common/minidump_size.h '/usr/local/include/breakpad/google_breakpad/common'
03-Jan-2021 00:11:30 #13 126.5  /bin/mkdir -p '/usr/local/include/breakpad/third_party/lss'
03-Jan-2021 00:11:30 #13 126.5  /usr/bin/install -c -m 644 ./src/third_party/lss/linux_syscall_support.h '/usr/local/include/breakpad/third_party/lss'
03-Jan-2021 00:11:30 #13 126.5  /bin/mkdir -p '/usr/local/include/breakpad/processor'
03-Jan-2021 00:11:30 #13 126.6  /usr/bin/install -c -m 644 ./src/processor/address_map-inl.h ./src/processor/address_map.h ./src/processor/basic_code_module.h ./src/processor/basic_code_modules.h ./src/processor/basic_source_line_resolver_types.h ./src/processor/cfi_frame_info-inl.h ./src/processor/cfi_frame_info.h ./src/processor/contained_range_map-inl.h ./src/processor/contained_range_map.h ./src/processor/convert_old_arm64_context.h ./src/processor/disassembler_x86.h ./src/processor/exploitability_linux.h ./src/processor/exploitability_win.h ./src/processor/fast_source_line_resolver_types.h ./src/processor/linked_ptr.h ./src/processor/logging.h ./src/processor/map_serializers-inl.h ./src/processor/map_serializers.h ./src/processor/module_comparer.h ./src/processor/module_factory.h ./src/processor/module_serializer.h ./src/processor/pathname_stripper.h ./src/processor/postfix_evaluator-inl.h ./src/processor/postfix_evaluator.h ./src/processor/range_map-inl.h ./src/processor/range_map.h ./src/processor/simple_serializer-inl.h ./src/processor/simple_serializer.h ./src/processor/simple_symbol_supplier.h ./src/processor/source_line_resolver_base_types.h ./src/processor/stackwalk_common.h ./src/processor/stackwalker_address_list.h ./src/processor/stackwalker_amd64.h ./src/processor/stackwalker_arm.h ./src/processor/stackwalker_arm64.h ./src/processor/stackwalker_mips.h ./src/processor/stackwalker_ppc.h ./src/processor/stackwalker_ppc64.h ./src/processor/stackwalker_sparc.h ./src/processor/stackwalker_unittest_utils.h '/usr/local/include/breakpad/processor'
03-Jan-2021 00:11:30 #13 126.6  /usr/bin/install -c -m 644 ./src/processor/stackwalker_x86.h ./src/processor/static_address_map-inl.h ./src/processor/static_address_map.h ./src/processor/static_contained_range_map-inl.h ./src/processor/static_contained_range_map.h ./src/processor/static_map-inl.h ./src/processor/static_map.h ./src/processor/static_map_iterator-inl.h ./src/processor/static_map_iterator.h ./src/processor/static_range_map-inl.h ./src/processor/static_range_map.h ./src/processor/symbolic_constants_win.h ./src/processor/synth_minidump.h ./src/processor/synth_minidump_unittest_data.h ./src/processor/tokenize.h ./src/processor/windows_frame_info.h '/usr/local/include/breakpad/processor'
03-Jan-2021 00:11:30 #13 126.6  /bin/mkdir -p '/usr/local/lib/pkgconfig'
03-Jan-2021 00:11:30 #13 126.6  /usr/bin/install -c -m 644 breakpad-client.pc '/usr/local/lib/pkgconfig'
03-Jan-2021 00:11:30 #13 126.6 make[1]: Leaving directory '/opt/breakpad/src'
03-Jan-2021 00:11:30 #13 DONE 127.0s
03-Jan-2021 00:11:31
03-Jan-2021 00:11:31 #14 [builder 6/15] RUN git clone https://github.com/OpenZWave/open-zwave.git...
03-Jan-2021 00:11:32 #14 1.171 Cloning into 'open-zwave'...
03-Jan-2021 00:12:04 #14 33.37 make[1]: warning: -j12 forced in submake: resetting jobserver mode.
03-Jan-2021 00:12:04 #14 33.37 make[1]: Entering directory '/opt/open-zwave/cpp/build'
03-Jan-2021 00:12:04 #14 33.57 Building tinyxml/tinystr.cpp
03-Jan-2021 00:12:04 #14 33.57 Building OpenZWave Version 1.6-1665-g4fe9af83 - 1.6.1665
03-Jan-2021 00:12:04 #14 33.57 Building tinyxml/tinyxmlerror.cpp
03-Jan-2021 00:12:04 #14 33.57 Building tinyxml/tinyxml.cpp
03-Jan-2021 00:12:04 #14 33.58 Building aes/aeskey.c
03-Jan-2021 00:12:04 #14 33.58 Building tinyxml/tinyxmlparser.cpp
03-Jan-2021 00:12:04 #14 33.58 Building aes/aescrypt.c
03-Jan-2021 00:12:04 #14 33.58 Building aes/aestab.c
03-Jan-2021 00:12:04 #14 33.60 Building aes/aes_modes.c
03-Jan-2021 00:12:04 #14 33.61 Building src/command_classes/Security.cpp
03-Jan-2021 00:12:04 #14 33.67 Building src/command_classes/Proprietary.cpp
03-Jan-2021 00:12:04 #14 33.68 Building src/command_classes/SwitchMultilevel.cpp
03-Jan-2021 00:12:04 #14 33.68 Building src/command_classes/Meter.cpp
03-Jan-2021 00:12:05 #14 34.14 Building src/command_classes/MeterPulse.cpp
03-Jan-2021 00:12:05 #14 34.29 Building src/command_classes/DoorLockLogging.cpp
03-Jan-2021 00:12:06 #14 35.08 /opt/open-zwave/cpp/src/aes/aescrypt.c:23: fatal error: when writing output to : No space left on device
03-Jan-2021 00:12:06 #14 35.08 
03-Jan-2021 00:12:06 #14 35.08 
03-Jan-2021 00:12:06 #14 35.08 compilation terminated.
03-Jan-2021 00:12:06 #14 35.08 distcc[288] ERROR: compile /opt/open-zwave/cpp/src/aes/aescrypt.c on armhf-5.dmz.dynam.ac failed
03-Jan-2021 00:12:06 #14 35.08 distcc[288] (dcc_build_somewhere) Warning: remote compilation of '/opt/open-zwave/cpp/src/aes/aescrypt.c' failed, retrying locally
03-Jan-2021 00:12:06 #14 35.08 distcc[288] (dcc_open_lockfile) ERROR: failed to creat /root/.distcc/lock/backoff_tcp_armhf-5.dmz.dynam.ac_3632_0: No space left on device
03-Jan-2021 00:12:06 #14 35.08 distcc[288] Warning: failed to distribute /opt/open-zwave/cpp/src/aes/aescrypt.c to armhf-5.dmz.dynam.ac, running locally instead
03-Jan-2021 00:12:06 #14 35.09 Cannot create temporary file in /tmp/: No space left on device
03-Jan-2021 00:12:06 #14 35.09 distcc[288] ERROR: compile /opt/open-zwave/cpp/src/aes/aescrypt.c on localhost: Aborted
03-Jan-2021 00:12:06 #14 35.09 distcc[288] (dcc_please_send_email_after_investigation) Warning: remote compilation of '/opt/open-zwave/cpp/src/aes/aescrypt.c' failed, retried locally and got a different result.
03-Jan-2021 00:12:06 #14 35.09 make[1]: *** [/opt/open-zwave/cpp/build/support.mk:203: /opt/open-zwave/.lib/aescrypt.o] Error 134
03-Jan-2021 00:12:06 #14 35.09 make[1]: *** Waiting for unfinished jobs....
03-Jan-2021 00:12:06 #14 35.28 distcc[176] (dcc_r_file) ERROR: failed to create /opt/open-zwave/.lib/tinyxmlparser.o: No space left on device
03-Jan-2021 00:12:06 #14 35.28 distcc[176] (dcc_open_lockfile) ERROR: failed to creat /root/.distcc/lock/backoff_tcp_armhf-2.dmz.dynam.ac_3632_0: No space left on device
03-Jan-2021 00:12:06 #14 35.28 distcc[176] Warning: failed to distribute /opt/open-zwave/cpp/tinyxml/tinyxmlparser.cpp to armhf-2.dmz.dynam.ac, running locally instead
03-Jan-2021 00:12:06 #14 35.29 Cannot create temporary file in /tmp/: No space left on device
03-Jan-2021 00:12:06 #14 35.29 distcc[176] ERROR: compile /opt/open-zwave/cpp/tinyxml/tinyxmlparser.cpp on localhost: Aborted
03-Jan-2021 00:12:06 #14 35.29 make[1]: *** [/opt/open-zwave/cpp/build/support.mk:192: /opt/open-zwave/.lib/tinyxmlparser.o] Error 134
03-Jan-2021 00:12:06 #14 35.35 distcc[241] (dcc_open_state) ERROR: failed to open /root/.distcc/state/binstate_241: No space left on device
03-Jan-2021 00:12:06 #14 35.52 distcc[182] (dcc_r_file) ERROR: failed to create /opt/open-zwave/.lib/aes_modes.o: No space left on device
03-Jan-2021 00:12:06 #14 35.52 distcc[182] (dcc_open_lockfile) ERROR: failed to creat /root/.distcc/lock/backoff_tcp_armhf-5.dmz.dynam.ac_3632_0: No space left on device
03-Jan-2021 00:12:06 #14 35.52 distcc[182] Warning: failed to distribute /opt/open-zwave/cpp/src/aes/aes_modes.c to armhf-5.dmz.dynam.ac, running locally instead
03-Jan-2021 00:12:06 #14 35.53 Cannot create temporary file in /tmp/: No space left on device
03-Jan-2021 00:12:06 #14 35.53 distcc[182] ERROR: compile /opt/open-zwave/cpp/src/aes/aes_modes.c on localhost: Aborted
03-Jan-2021 00:12:06 #14 35.53 make[1]: *** [/opt/open-zwave/cpp/build/support.mk:203: /opt/open-zwave/.lib/aes_modes.o] Error 134
03-Jan-2021 00:12:06 #14 35.57 /bin/sh: 1: cannot create /opt/open-zwave/.dep/DoorLockLogging.d: No space left on device
03-Jan-2021 00:12:06 #14 35.57 make[1]: *** [/opt/open-zwave/cpp/build/support.mk:189: /opt/open-zwave/.lib/DoorLockLogging.o] Error 2
03-Jan-2021 00:12:06 #14 35.67 /opt/open-zwave/cpp/src/aes/aestab.c:177: fatal error: when writing output to : No space left on device
03-Jan-2021 00:12:06 #14 35.67 
03-Jan-2021 00:12:06 #14 35.67 
03-Jan-2021 00:12:06 #14 35.67 compilation terminated.
03-Jan-2021 00:12:06 #14 35.68 distcc[287] ERROR: compile /opt/open-zwave/cpp/src/aes/aestab.c on armhf-4.dmz.dynam.ac failed
03-Jan-2021 00:12:06 #14 35.68 distcc[287] (dcc_build_somewhere) Warning: remote compilation of '/opt/open-zwave/cpp/src/aes/aestab.c' failed, retrying locally
03-Jan-2021 00:12:06 #14 35.68 distcc[287] (dcc_open_lockfile) ERROR: failed to creat /root/.distcc/lock/backoff_tcp_armhf-4.dmz.dynam.ac_3632_0: No space left on device
03-Jan-2021 00:12:06 #14 35.68 distcc[287] Warning: failed to distribute /opt/open-zwave/cpp/src/aes/aestab.c to armhf-4.dmz.dynam.ac, running locally instead
03-Jan-2021 00:12:06 #14 35.69 Cannot create temporary file in /tmp/: No space left on device
03-Jan-2021 00:12:06 #14 35.69 distcc[287] ERROR: compile /opt/open-zwave/cpp/src/aes/aestab.c on localhost: Aborted
03-Jan-2021 00:12:06 #14 35.69 distcc[287] (dcc_please_send_email_after_investigation) Warning: remote compilation of '/opt/open-zwave/cpp/src/aes/aestab.c' failed, retried locally and got a different result.
03-Jan-2021 00:12:06 #14 35.69 make[1]: *** [/opt/open-zwave/cpp/build/support.mk:203: /opt/open-zwave/.lib/aestab.o] Error 134
03-Jan-2021 00:12:09 #14 38.20 make[1]: Leaving directory '/opt/open-zwave/cpp/build'
03-Jan-2021 00:12:09 #14 38.21 make: *** [Makefile:23: all] Error 2
03-Jan-2021 00:12:09 #14 ERROR: executor failed running [/bin/sh -c git clone https://github.com/OpenZWave/open-zwave.git         && cd open-zwave         && make -j${concurrency}         && make install instlibdir=/usr/local/lib/]: runc did not terminate sucessfully
03-Jan-2021 00:12:09 ------
03-Jan-2021 00:12:09 > [builder 6/15] RUN git clone https://github.com/OpenZWave/open-zwave.git         && cd open-zwave         && make -j12         && make install instlibdir=/usr/local/lib/:
03-Jan-2021 00:12:09 ------
03-Jan-2021 00:12:09 failed to solve with frontend dockerfile.v0: failed to build LLB: executor failed running [/bin/sh -c git clone https://github.com/OpenZWave/open-zwave.git         && cd open-zwave         && make -j${concurrency}         && make install instlibdir=/usr/local/lib/]: runc did not terminate sucessfully
03-Jan-2021 00:12:09 Failing task since return code of [/home/bamboo/bamboo-agent-home/temp/OZW-OO-ARM7-183-ScriptBuildTask-8492400872421686102.sh] was 1 while expected 0
03-Jan-2021 00:12:09 Finished task 'Build Docker Images' with result: Failed
03-Jan-2021 00:12:09 Running post build plugin 'Docker Container Cleanup'
03-Jan-2021 00:12:09 Running post build plugin 'NCover Results Collector'
03-Jan-2021 00:12:09 Running post build plugin 'Clover Results Collector'
03-Jan-2021 00:12:09 Running post build plugin 'npm Cache Cleanup'
03-Jan-2021 00:12:09 Running post build plugin 'Artifact Copier'
03-Jan-2021 00:12:09 Finalising the build...
03-Jan-2021 00:12:09 Stopping timer.
03-Jan-2021 00:12:09 Build OZW-OO-ARM7-183 completed.
03-Jan-2021 00:12:09 Running on server: post build plugin 'NCover Results Collector'
03-Jan-2021 00:12:09 Running on server: post build plugin 'Build Hanging Detection Configuration'
03-Jan-2021 00:12:09 Running on server: post build plugin 'Clover Delta Calculator'
03-Jan-2021 00:12:09 Running on server: post build plugin 'Maven Dependencies Postprocessor'
03-Jan-2021 00:12:09 All post build plugins have finished
03-Jan-2021 00:12:09 Generating build results summary...
03-Jan-2021 00:12:10 Saving build results to disk...
03-Jan-2021 00:12:10 Logging substituted variables...
03-Jan-2021 00:12:10 Indexing build results...
03-Jan-2021 00:12:10 Finished building OZW-OO-ARM7-183.