ozwdaemon Docker Image Builds

Build: #183 failed Scheduled with changes by 25 people

Logs

The following logs have been generated by the jobs in this plan.
  • Expand all
  • Collapse all
Job Logs
Collapse Armhf Build Docker Build Download or View
03-Jan-2021 00:12:06 #14 35.52 distcc[182] Warning: failed to distribute /opt/open-zwave/cpp/src/aes/aes_modes.c to armhf-5.dmz.dynam.ac, running locally instead
03-Jan-2021 00:12:06 #14 35.53 Cannot create temporary file in /tmp/: No space left on device
03-Jan-2021 00:12:06 #14 35.53 distcc[182] ERROR: compile /opt/open-zwave/cpp/src/aes/aes_modes.c on localhost: Aborted
03-Jan-2021 00:12:06 #14 35.53 make[1]: *** [/opt/open-zwave/cpp/build/support.mk:203: /opt/open-zwave/.lib/aes_modes.o] Error 134
03-Jan-2021 00:12:06 #14 35.57 /bin/sh: 1: cannot create /opt/open-zwave/.dep/DoorLockLogging.d: No space left on device
03-Jan-2021 00:12:06 #14 35.57 make[1]: *** [/opt/open-zwave/cpp/build/support.mk:189: /opt/open-zwave/.lib/DoorLockLogging.o] Error 2
03-Jan-2021 00:12:06 #14 35.67 /opt/open-zwave/cpp/src/aes/aestab.c:177: fatal error: when writing output to : No space left on device
03-Jan-2021 00:12:06 #14 35.67 
03-Jan-2021 00:12:06 #14 35.67 
03-Jan-2021 00:12:06 #14 35.67 compilation terminated.
03-Jan-2021 00:12:06 #14 35.68 distcc[287] ERROR: compile /opt/open-zwave/cpp/src/aes/aestab.c on armhf-4.dmz.dynam.ac failed
03-Jan-2021 00:12:06 #14 35.68 distcc[287] (dcc_build_somewhere) Warning: remote compilation of '/opt/open-zwave/cpp/src/aes/aestab.c' failed, retrying locally
03-Jan-2021 00:12:06 #14 35.68 distcc[287] (dcc_open_lockfile) ERROR: failed to creat /root/.distcc/lock/backoff_tcp_armhf-4.dmz.dynam.ac_3632_0: No space left on device
03-Jan-2021 00:12:06 #14 35.68 distcc[287] Warning: failed to distribute /opt/open-zwave/cpp/src/aes/aestab.c to armhf-4.dmz.dynam.ac, running locally instead
03-Jan-2021 00:12:06 #14 35.69 Cannot create temporary file in /tmp/: No space left on device
03-Jan-2021 00:12:06 #14 35.69 distcc[287] ERROR: compile /opt/open-zwave/cpp/src/aes/aestab.c on localhost: Aborted
03-Jan-2021 00:12:06 #14 35.69 distcc[287] (dcc_please_send_email_after_investigation) Warning: remote compilation of '/opt/open-zwave/cpp/src/aes/aestab.c' failed, retried locally and got a different result.
03-Jan-2021 00:12:06 #14 35.69 make[1]: *** [/opt/open-zwave/cpp/build/support.mk:203: /opt/open-zwave/.lib/aestab.o] Error 134
03-Jan-2021 00:12:09 #14 38.20 make[1]: Leaving directory '/opt/open-zwave/cpp/build'
03-Jan-2021 00:12:09 #14 38.21 make: *** [Makefile:23: all] Error 2
03-Jan-2021 00:12:09 #14 ERROR: executor failed running [/bin/sh -c git clone https://github.com/OpenZWave/open-zwave.git         && cd open-zwave         && make -j${concurrency}         && make install instlibdir=/usr/local/lib/]: runc did not terminate sucessfully
03-Jan-2021 00:12:09 ------
03-Jan-2021 00:12:09 > [builder 6/15] RUN git clone https://github.com/OpenZWave/open-zwave.git         && cd open-zwave         && make -j12         && make install instlibdir=/usr/local/lib/:
03-Jan-2021 00:12:09 ------
03-Jan-2021 00:12:09 failed to solve with frontend dockerfile.v0: failed to build LLB: executor failed running [/bin/sh -c git clone https://github.com/OpenZWave/open-zwave.git         && cd open-zwave         && make -j${concurrency}         && make install instlibdir=/usr/local/lib/]: runc did not terminate sucessfully