ozwdaemon Docker Image Builds

Build: #183 failed Scheduled with changes by 25 people

Build result summary

Details

Completed
Duration
48 minutes
Labels
None
Revisions
qt-openzwave
7ebd43e246e97851ad20f2b1bb9c62bfd6a4a6ef 7ebd43e246e97851ad20f2b1bb9c62bfd6a4a6ef
OpenZwave - Master Repository
4fe9af833a6d1fc8949918bf117e131378b7d059 4fe9af833a6d1fc8949918bf117e131378b7d059
Fixed in
#191 (Scheduled with changes by 5 people)
No failed test found. A possible compilation error occurred.

Responsible

Comments

  1. AiderbPer

    <a href=http://vskamagrav.com/&gt;kamagra 100[/url]

  2. AiderbPer

    <a href=https://priligyset.com/&gt;cialis dapoxetine overnight shipping[/url]

  3. AiderbPer

    <a href=https://vsprednisonev.com&gt;buy prednisone online no rx canada[/url]

  4. AiderbPer

    <a href=https://vsprednisonev.com&gt;prednisone online[/url]

  5. AiderbPer

    <a href=https://priligyset.com&gt;onde comprar dapoxetina no brasil[/url]

  6. AiderbPer

    <a href=https://vsamoxilv.com>[/url]

  7. AiderbPer

    <a href=http://cialiswwshop.com/&gt;generic 5 mg cialis</a>

Code commits

OpenZwave - Master Repository
Author Commit Message Commit date
Jean-François Auger <nechry@gmail.com> Jean-François Auger <nechry@gmail.com> 4fe9af833a6d1fc8949918bf117e131378b7d059 4fe9af833a6d1fc8949918bf117e131378b7d059 Merge pull request #2480 from wauswaus/master
Fixed two issues in nas-pd03z.xml
nechry <nechry@gmail.com> nechry <nechry@gmail.com> ca3679380ecc47c38d4ec32e563d74ba2776d17e ca3679380ecc47c38d4ec32e563d74ba2776d17e fix Revision Number Was Not Bumped
Jean-François Auger <nechry@gmail.com> Jean-François Auger <nechry@gmail.com> 799848700ace223f382c047c8a9638b47d7877e5 799848700ace223f382c047c8a9638b47d7877e5 Merge pull request #2482 from kevlee/master
add config for curtain switch NAS-CS01Z Curtain Switch (Shenzhen Neo Electronics Co Ltd)
Jean-François Auger <nechry@gmail.com> Jean-François Auger <nechry@gmail.com> e37f3605af41d2e6546c353887831a5c84ea89d2 e37f3605af41d2e6546c353887831a5c84ea89d2 Merge branch 'master' into master
nechry <nechry@gmail.com> nechry <nechry@gmail.com> 676c53d07695675dbd9a5d270639ec529b2d2879 676c53d07695675dbd9a5d270639ec529b2d2879 Update testconfigversions.cfg

Jira issues

IssueDescriptionStatus
Unknown Issue TypeFGWPB-121Could not obtain issue details from Jira

Error summary for Armhf Build

The job generated some errors, drill down into the full build log for more details.

#13 125.6 ar cru src/client/linux/libbreakpad_client.a src/client/linux/crash_generation/crash_generation_client.o src/client/linux/crash_generation/crash_generation_server.o src/client/linux/dump_writer_common/thread_info.o src/client/linux/dump_writer_common/ucontext_reader.o src/client/linux/handler/exception_handler.o src/client/linux/handler/minidump_descriptor.o src/client/linux/log/log.o src/client/linux/microdump_writer/microdump_writer.o src/client/linux/minidump_writer/linux_core_dumper.o src/client/linux/minidump_writer/linux_dumper.o src/client/linux/minidump_writer/linux_ptrace_dumper.o src/client/linux/minidump_writer/minidump_writer.o src/client/minidump_file_writer.o src/common/convert_UTF.o src/common/md5.o src/common/string_conversion.o src/common/linux/elf_core_dump.o src/common/linux/elfutils.o src/common/linux/file_id.o src/common/linux/guid_creator.o src/common/linux/linux_libc_support.o src/common/linux/memory_mapped_file.o src/common/linux/safe_readlink.o 
#13 125.6 ar: `u' modifier ignored since `D' is the default (see `U')
#13 125.6 ranlib src/client/linux/libbreakpad_client.a
#13 126.1 make[1]: Entering directory '/opt/breakpad/src'
#13 126.1  /bin/mkdir -p '/usr/local/bin'
#13 126.2  /bin/mkdir -p '/usr/local/lib'
#13 126.2  /usr/bin/install -c -m 644  src/client/linux/libbreakpad_client.a '/usr/local/lib'
#13 126.2  ( cd '/usr/local/lib' && ranlib libbreakpad_client.a )
#13 126.3  /bin/mkdir -p '/usr/local/share/doc/breakpad-0.1'
#13 126.3  /usr/bin/install -c -m 644 AUTHORS ChangeLog INSTALL LICENSE NEWS README.md '/usr/local/share/doc/breakpad-0.1'
#13 126.3  /bin/mkdir -p '/usr/local/include/breakpad/common'
#13 126.3  /usr/bin/install -c -m 644 ./src/common/basictypes.h ./src/common/byte_cursor.h ./src/common/convert_UTF.h ./src/common/dwarf_cfi_to_module.h ./src/common/dwarf_cu_to_module.h ./src/common/dwarf_line_to_module.h ./src/common/dwarf_range_list_handler.h ./src/common/language.h ./src/common/long_string_dictionary.h ./src/common/macros.h ./src/common/md5.h ./src/common/memory_allocator.h ./src/common/memory_range.h ./src/common/minidump_type_helper.h ./src/common/module.h ./src/common/path_helper.h ./src/common/scoped_ptr.h ./src/common/simple_string_dictionary.h ./src/common/stabs_reader.h ./src/common/stabs_to_module.h ./src/common/stdio_wrapper.h ./src/common/string_conversion.h ./src/common/symbol_data.h ./src/common/test_assembler.h ./src/common/unordered.h ./src/common/using_std_string.h '/usr/local/include/breakpad/common'
#13 126.3  /bin/mkdir -p '/usr/local/include/breakpad/common/linux'
#13 126.3  /usr/bin/install -c -m 644 ./src/common/linux/breakpad_getcontext.h ./src/common/linux/crc32.h ./src/common/linux/dump_symbols.h ./src/common/linux/eintr_wrapper.h ./src/common/linux/elf_core_dump.h ./src/common/linux/elf_gnu_compat.h ./src/common/linux/elf_symbols_to_module.h ./src/common/linux/elfutils-inl.h ./src/common/linux/elfutils.h ./src/common/linux/file_id.h ./src/common/linux/google_crashdump_uploader.h ./src/common/linux/guid_creator.h ./src/common/linux/http_upload.h ./src/common/linux/ignore_ret.h ./src/common/linux/libcurl_wrapper.h ./src/common/linux/linux_libc_support.h ./src/common/linux/memory_mapped_file.h ./src/common/linux/safe_readlink.h ./src/common/linux/symbol_collector_client.h ./src/common/linux/symbol_upload.h ./src/common/linux/synth_elf.h ./src/common/linux/ucontext_constants.h '/usr/local/include/breakpad/common/linux'
#13 126.3  /bin/mkdir -p '/usr/local/include/breakpad/client/linux/crash_generation'
#13 126.4  /usr/bin/install -c -m 644 ./src/client/linux/crash_generation/client_info.h ./src/client/linux/crash_generation/crash_generation_client.h ./src/client/linux/crash_generation/crash_generation_server.h '/usr/local/include/breakpad/client/linux/crash_generation'
#13 126.4  /bin/mkdir -p '/usr/local/include/breakpad/client/linux/dump_writer_common'
#13 126.4  /usr/bin/install -c -m 644 ./src/client/linux/dump_writer_common/mapping_info.h ./src/client/linux/dump_writer_common/raw_context_cpu.h ./src/client/linux/dump_writer_common/thread_info.h ./src/client/linux/dump_writer_common/ucontext_reader.h '/usr/local/include/breakpad/client/linux/dump_writer_common'
#13 126.4  /bin/mkdir -p '/usr/local/include/breakpad/client/linux/handler'
#13 126.4  /usr/bin/install -c -m 644 ./src/client/linux/handler/exception_handler.h ./src/client/linux/handler/microdump_extra_info.h ./src/client/linux/handler/minidump_descriptor.h '/usr/local/include/breakpad/client/linux/handler'
#13 126.4  /bin/mkdir -p '/usr/local/include/breakpad/client/linux/minidump_writer'
#13 126.4  /usr/bin/install -c -m 644 ./src/client/linux/minidump_writer/cpu_set.h ./src/client/linux/minidump_writer/directory_reader.h ./src/client/linux/minidump_writer/line_reader.h ./src/client/linux/minidump_writer/linux_core_dumper.h ./src/client/linux/minidump_writer/linux_dumper.h ./src/client/linux/minidump_writer/linux_ptrace_dumper.h ./src/client/linux/minidump_writer/minidump_writer.h ./src/client/linux/minidump_writer/minidump_writer_unittest_utils.h ./src/client/linux/minidump_writer/proc_cpuinfo_reader.h '/usr/local/include/breakpad/client/linux/minidump_writer'
#13 126.5  /bin/mkdir -p '/usr/local/include/breakpad/google_breakpad/common'
#13 126.5  /usr/bin/install -c -m 644 ./src/google_breakpad/common/breakpad_types.h ./src/google_breakpad/common/minidump_cpu_amd64.h ./src/google_breakpad/common/minidump_cpu_arm.h ./src/google_breakpad/common/minidump_cpu_arm64.h ./src/google_breakpad/common/minidump_cpu_mips.h ./src/google_breakpad/common/minidump_cpu_ppc.h ./src/google_breakpad/common/minidump_cpu_ppc64.h ./src/google_breakpad/common/minidump_cpu_sparc.h ./src/google_breakpad/common/minidump_cpu_x86.h ./src/google_breakpad/common/minidump_exception_fuchsia.h ./src/google_breakpad/common/minidump_exception_linux.h ./src/google_breakpad/common/minidump_exception_mac.h ./src/google_breakpad/common/minidump_exception_ps3.h ./src/google_breakpad/common/minidump_exception_solaris.h ./src/google_breakpad/common/minidump_exception_win32.h ./src/google_breakpad/common/minidump_format.h ./src/google_breakpad/common/minidump_size.h '/usr/local/include/breakpad/google_breakpad/common'
#13 126.5  /bin/mkdir -p '/usr/local/include/breakpad/third_party/lss'
#13 126.5  /usr/bin/install -c -m 644 ./src/third_party/lss/linux_syscall_support.h '/usr/local/include/breakpad/third_party/lss'
#13 126.5  /bin/mkdir -p '/usr/local/include/breakpad/processor'
#13 126.6  /usr/bin/install -c -m 644 ./src/processor/address_map-inl.h ./src/processor/address_map.h ./src/processor/basic_code_module.h ./src/processor/basic_code_modules.h ./src/processor/basic_source_line_resolver_types.h ./src/processor/cfi_frame_info-inl.h ./src/processor/cfi_frame_info.h ./src/processor/contained_range_map-inl.h ./src/processor/contained_range_map.h ./src/processor/convert_old_arm64_context.h ./src/processor/disassembler_x86.h ./src/processor/exploitability_linux.h ./src/processor/exploitability_win.h ./src/processor/fast_source_line_resolver_types.h ./src/processor/linked_ptr.h ./src/processor/logging.h ./src/processor/map_serializers-inl.h ./src/processor/map_serializers.h ./src/processor/module_comparer.h ./src/processor/module_factory.h ./src/processor/module_serializer.h ./src/processor/pathname_stripper.h ./src/processor/postfix_evaluator-inl.h ./src/processor/postfix_evaluator.h ./src/processor/range_map-inl.h ./src/processor/range_map.h ./src/processor/simple_serializer-inl.h ./src/processor/simple_serializer.h ./src/processor/simple_symbol_supplier.h ./src/processor/source_line_resolver_base_types.h ./src/processor/stackwalk_common.h ./src/processor/stackwalker_address_list.h ./src/processor/stackwalker_amd64.h ./src/processor/stackwalker_arm.h ./src/processor/stackwalker_arm64.h ./src/processor/stackwalker_mips.h ./src/processor/stackwalker_ppc.h ./src/processor/stackwalker_ppc64.h ./src/processor/stackwalker_sparc.h ./src/processor/stackwalker_unittest_utils.h '/usr/local/include/breakpad/processor'
#13 126.6  /usr/bin/install -c -m 644 ./src/processor/stackwalker_x86.h ./src/processor/static_address_map-inl.h ./src/processor/static_address_map.h ./src/processor/static_contained_range_map-inl.h ./src/processor/static_contained_range_map.h ./src/processor/static_map-inl.h ./src/processor/static_map.h ./src/processor/static_map_iterator-inl.h ./src/processor/static_map_iterator.h ./src/processor/static_range_map-inl.h ./src/processor/static_range_map.h ./src/processor/symbolic_constants_win.h ./src/processor/synth_minidump.h ./src/processor/synth_minidump_unittest_data.h ./src/processor/tokenize.h ./src/processor/windows_frame_info.h '/usr/local/include/breakpad/processor'
#13 126.6  /bin/mkdir -p '/usr/local/lib/pkgconfig'
#13 126.6  /usr/bin/install -c -m 644 breakpad-client.pc '/usr/local/lib/pkgconfig'
#13 126.6 make[1]: Leaving directory '/opt/breakpad/src'
#13 DONE 127.0s

#14 [builder 6/15] RUN git clone https://github.com/OpenZWave/open-zwave.git...
#14 1.171 Cloning into 'open-zwave'...
#14 33.37 make[1]: warning: -j12 forced in submake: resetting jobserver mode.
#14 33.37 make[1]: Entering directory '/opt/open-zwave/cpp/build'
#14 33.57 Building tinyxml/tinystr.cpp
#14 33.57 Building OpenZWave Version 1.6-1665-g4fe9af83 - 1.6.1665
#14 33.57 Building tinyxml/tinyxmlerror.cpp
#14 33.57 Building tinyxml/tinyxml.cpp
#14 33.58 Building aes/aeskey.c
#14 33.58 Building tinyxml/tinyxmlparser.cpp
#14 33.58 Building aes/aescrypt.c
#14 33.58 Building aes/aestab.c
#14 33.60 Building aes/aes_modes.c
#14 33.61 Building src/command_classes/Security.cpp
#14 33.67 Building src/command_classes/Proprietary.cpp
#14 33.68 Building src/command_classes/SwitchMultilevel.cpp
#14 33.68 Building src/command_classes/Meter.cpp
#14 34.14 Building src/command_classes/MeterPulse.cpp
#14 34.29 Building src/command_classes/DoorLockLogging.cpp
#14 35.08 /opt/open-zwave/cpp/src/aes/aescrypt.c:23: fatal error: when writing output to : No space left on device
#14 35.08 
#14 35.08 
#14 35.08 compilation terminated.
#14 35.08 distcc[288] ERROR: compile /opt/open-zwave/cpp/src/aes/aescrypt.c on armhf-5.dmz.dynam.ac failed
#14 35.08 distcc[288] (dcc_build_somewhere) Warning: remote compilation of '/opt/open-zwave/cpp/src/aes/aescrypt.c' failed, retrying locally
#14 35.08 distcc[288] (dcc_open_lockfile) ERROR: failed to creat /root/.distcc/lock/backoff_tcp_armhf-5.dmz.dynam.ac_3632_0: No space left on device
#14 35.08 distcc[288] Warning: failed to distribute /opt/open-zwave/cpp/src/aes/aescrypt.c to armhf-5.dmz.dynam.ac, running locally instead
#14 35.09 Cannot create temporary file in /tmp/: No space left on device
#14 35.09 distcc[288] ERROR: compile /opt/open-zwave/cpp/src/aes/aescrypt.c on localhost: Aborted
#14 35.09 distcc[288] (dcc_please_send_email_after_investigation) Warning: remote compilation of '/opt/open-zwave/cpp/src/aes/aescrypt.c' failed, retried locally and got a different result.
#14 35.09 make[1]: *** [/opt/open-zwave/cpp/build/support.mk:203: /opt/open-zwave/.lib/aescrypt.o] Error 134
#14 35.09 make[1]: *** Waiting for unfinished jobs....
#14 35.28 distcc[176] (dcc_r_file) ERROR: failed to create /opt/open-zwave/.lib/tinyxmlparser.o: No space left on device
#14 35.28 distcc[176] (dcc_open_lockfile) ERROR: failed to creat /root/.distcc/lock/backoff_tcp_armhf-2.dmz.dynam.ac_3632_0: No space left on device
#14 35.28 distcc[176] Warning: failed to distribute /opt/open-zwave/cpp/tinyxml/tinyxmlparser.cpp to armhf-2.dmz.dynam.ac, running locally instead
#14 35.29 Cannot create temporary file in /tmp/: No space left on device
#14 35.29 distcc[176] ERROR: compile /opt/open-zwave/cpp/tinyxml/tinyxmlparser.cpp on localhost: Aborted
#14 35.29 make[1]: *** [/opt/open-zwave/cpp/build/support.mk:192: /opt/open-zwave/.lib/tinyxmlparser.o] Error 134
#14 35.35 distcc[241] (dcc_open_state) ERROR: failed to open /root/.distcc/state/binstate_241: No space left on device
#14 35.52 distcc[182] (dcc_r_file) ERROR: failed to create /opt/open-zwave/.lib/aes_modes.o: No space left on device
#14 35.52 distcc[182] (dcc_open_lockfile) ERROR: failed to creat /root/.distcc/lock/backoff_tcp_armhf-5.dmz.dynam.ac_3632_0: No space left on device
#14 35.52 distcc[182] Warning: failed to distribute /opt/open-zwave/cpp/src/aes/aes_modes.c to armhf-5.dmz.dynam.ac, running locally instead
#14 35.53 Cannot create temporary file in /tmp/: No space left on device
#14 35.53 distcc[182] ERROR: compile /opt/open-zwave/cpp/src/aes/aes_modes.c on localhost: Aborted
#14 35.53 make[1]: *** [/opt/open-zwave/cpp/build/support.mk:203: /opt/open-zwave/.lib/aes_modes.o] Error 134
#14 35.57 /bin/sh: 1: cannot create /opt/open-zwave/.dep/DoorLockLogging.d: No space left on device
#14 35.57 make[1]: *** [/opt/open-zwave/cpp/build/support.mk:189: /opt/open-zwave/.lib/DoorLockLogging.o] Error 2
#14 35.67 /opt/open-zwave/cpp/src/aes/aestab.c:177: fatal error: when writing output to : No space left on device
#14 35.67 
#14 35.67 
#14 35.67 compilation terminated.
#14 35.68 distcc[287] ERROR: compile /opt/open-zwave/cpp/src/aes/aestab.c on armhf-4.dmz.dynam.ac failed
#14 35.68 distcc[287] (dcc_build_somewhere) Warning: remote compilation of '/opt/open-zwave/cpp/src/aes/aestab.c' failed, retrying locally
#14 35.68 distcc[287] (dcc_open_lockfile) ERROR: failed to creat /root/.distcc/lock/backoff_tcp_armhf-4.dmz.dynam.ac_3632_0: No space left on device
#14 35.68 distcc[287] Warning: failed to distribute /opt/open-zwave/cpp/src/aes/aestab.c to armhf-4.dmz.dynam.ac, running locally instead
#14 35.69 Cannot create temporary file in /tmp/: No space left on device
#14 35.69 distcc[287] ERROR: compile /opt/open-zwave/cpp/src/aes/aestab.c on localhost: Aborted
#14 35.69 distcc[287] (dcc_please_send_email_after_investigation) Warning: remote compilation of '/opt/open-zwave/cpp/src/aes/aestab.c' failed, retried locally and got a different result.
#14 35.69 make[1]: *** [/opt/open-zwave/cpp/build/support.mk:203: /opt/open-zwave/.lib/aestab.o] Error 134
#14 38.20 make[1]: Leaving directory '/opt/open-zwave/cpp/build'
#14 38.21 make: *** [Makefile:23: all] Error 2
#14 ERROR: executor failed running [/bin/sh -c git clone https://github.com/OpenZWave/open-zwave.git         && cd open-zwave         && make -j${concurrency}         && make install instlibdir=/usr/local/lib/]: runc did not terminate sucessfully
------
> [builder 6/15] RUN git clone https://github.com/OpenZWave/open-zwave.git         && cd open-zwave         && make -j12         && make install instlibdir=/usr/local/lib/:
------
failed to solve with frontend dockerfile.v0: failed to build LLB: executor failed running [/bin/sh -c git clone https://github.com/OpenZWave/open-zwave.git         && cd open-zwave         && make -j${concurrency}         && make install instlibdir=/usr/local/lib/]: runc did not terminate sucessfully