Build #200

OpenZWave Dev Branch

Build: #200 failed

Job: VS2017 Build failed

Job result summary

Completed
Duration
3 minutes
Agent
win8-buildhost.dmz.dynam.ac
Revision
81f01cbe8bf68d877693b5aae150b124278ba188 81f01cbe8bf68d877693b5aae150b124278ba188
Failing since
#197 (Code changes detected – )
No failed test found. A possible compilation error occurred.

Error summary

The build generated some errors. See the full build log for more details.

  HidController.cpp
c:\users\bamboo\bamboo-agent-home\xml-data\build-dir\ozw-odb-vs2017\cpp\src\platform\hidcontroller.cpp(412): error C2065: 'LogLevel_Detail': undeclared identifier [C:\Users\bamboo\bamboo-agent-home\xml-data\build-dir\OZW-ODB-VS2017\cpp\build\windows\vs2010\OpenZWave.vcxproj]
c:\users\bamboo\bamboo-agent-home\xml-data\build-dir\ozw-odb-vs2017\cpp\src\platform\hidcontroller.cpp(494): error C3861: 'LogData': identifier not found [C:\Users\bamboo\bamboo-agent-home\xml-data\build-dir\OZW-ODB-VS2017\cpp\build\windows\vs2010\OpenZWave.vcxproj]
(ClCompile target) ->
  c:\users\bamboo\bamboo-agent-home\xml-data\build-dir\ozw-odb-vs2017\cpp\src\platform\hidcontroller.cpp(412): error C2065: 'LogLevel_Detail': undeclared identifier [C:\Users\bamboo\bamboo-agent-home\xml-data\build-dir\OZW-ODB-VS2017\cpp\build\windows\vs2010\OpenZWave.vcxproj]
  c:\users\bamboo\bamboo-agent-home\xml-data\build-dir\ozw-odb-vs2017\cpp\src\platform\hidcontroller.cpp(494): error C3861: 'LogData': identifier not found [C:\Users\bamboo\bamboo-agent-home\xml-data\build-dir\OZW-ODB-VS2017\cpp\build\windows\vs2010\OpenZWave.vcxproj]