OpenZWave Dev Branch

Build: #199 failed

Job: VS2013 Build failed

Job result summary

Completed
Duration
4 minutes
Agent
win8-buildhost.dmz.dynam.ac
Revision
e9c80ebb0e1486478cc61c4d7a0df3a34400329e e9c80ebb0e1486478cc61c4d7a0df3a34400329e
Failing since
#197 (Changes by Justin Hammond)
No failed test found. A possible compilation error occurred.

Error summary

The build generated some errors. See the full build log for more details.

  HidController.cpp
..\..\..\src\platform\HidController.cpp(412): error C2065: 'LogLevel_Detail' : undeclared identifier [C:\Users\bamboo\bamboo-agent-home\xml-data\build-dir\OZW-ODB-VS2013\cpp\build\windows\vs2010\OpenZWave.vcxproj]
..\..\..\src\platform\HidController.cpp(494): error C3861: 'LogData': identifier not found [C:\Users\bamboo\bamboo-agent-home\xml-data\build-dir\OZW-ODB-VS2013\cpp\build\windows\vs2010\OpenZWave.vcxproj]
(ClCompile target) ->
  ..\..\..\src\platform\HidController.cpp(412): error C2065: 'LogLevel_Detail' : undeclared identifier [C:\Users\bamboo\bamboo-agent-home\xml-data\build-dir\OZW-ODB-VS2013\cpp\build\windows\vs2010\OpenZWave.vcxproj]
  ..\..\..\src\platform\HidController.cpp(494): error C3861: 'LogData': identifier not found [C:\Users\bamboo\bamboo-agent-home\xml-data\build-dir\OZW-ODB-VS2013\cpp\build\windows\vs2010\OpenZWave.vcxproj]